-
Posts
2,205 -
Joined
-
Last visited
Everything posted by Fadexz
-
Mod Menu Hack Mario Kart Tour v2.9.0 +10 [Jailbreak Bypass!]
Fadexz replied to 0xSUBZ3R0's topic in Free Jailbreak Cheats
Nice -
Hack FALLOUT SHELTER [V1.1+] SAVE GAME FILE [I-FUNBOX]
Fadexz replied to ItsMehAaryan's topic in Save Game Cheats
Nice -
Nice
-
Mod Menu Hack Fallout Shelter v1.22.1 +16 Groundbreaking CHEATS
Fadexz replied to 0xSUBZ3R0's topic in Free Jailbreak Cheats
Nice -
Nice
-
R.I.P the video, probably shouldn't have uploaded on YouTube. 😛 Awesome to see you creating aimbots now, great work!
-
Mod Menu Hack Coin Master 3.5.461 +3 [Card unlocks + More]
Fadexz replied to 0xSUBZ3R0's topic in Free Jailbreak Cheats
Nice -
Save Game Bloons TD Battles +3 [All Versions] [Anti-Flag]
Fadexz replied to Rainfall's topic in Save Game Cheats
Nice -
Hack BTD Battles Hack [2019] (Working) {Multiple Saves}
Fadexz replied to fiqstro's topic in Save Game Cheats
Nice -
Nice
-
Nice
-
Hack Call of Duty®: Mobile v1.0.8 [MEGA MOD MENU FUN]
Fadexz replied to 0xSUBZ3R0's topic in Free Jailbreak Cheats
Nice -
Nice
-
Nice
-
Awesome!!
-
Save Game True Skate Hack (All Versions) +4 Cheats!
Fadexz replied to --Techarmor--'s topic in Save Game Cheats
Nice -
Sweet!
-
The DADi himself. 😁 Yea it seems to be.. maybe just to make sure i'll have to try over again.
-
I tried reinstalling Theos because of a very similar error... now I have this. > Making all for tweak spotless… ==> Preprocessing Tweak.xm… ==> Preprocessing Tweak.xm… ==> Compiling Tweak.xm (armv7)… bash: line 1: 15184 Killed: 9 ( clang++ -x objective-c++ -c -I"/var/mobile/TheosProjects/Spotless" -I/var/theos/include -I/var/theos/vendor/include -I/var/theos/include/_fallback -include /var/theos/Prefix.pch -MT /var/mobile/TheosProjects/Spotless/.theos/obj/debug/armv7/Tweak.xm.5063494b.o -MMD -MP -MF "/var/mobile/TheosProjects/Spotless/.theos/obj/debug/armv7/Tweak.xm.5063494b.Td" -fcolor-diagnostics -DTARGET_IPHONE=1 -O0 -Wall -ggdb -Werror -isysroot "/var/theos/sdks/iPhoneOS11.2.sdk" -miphoneos-version-min=6.0 -fmodules -fcxx-modules -fmodule-name=spotless -fbuild-session-file=/var/mobile/TheosProjects/Spotless/.theos/build_session -fmodules-prune-after=345600 -fmodules-prune-interval=86400 -fmodules-validate-once-per-build-session -DDEBUG -O0 -DTHEOS_INSTANCE_NAME="\"spotless\"" -fmodules -fcxx-modules -fmodule-name=spotless -fbuild-session-file=/var/mobile/TheosProjects/Spotless/.theos/build_session -fmodules-prune-after=345600 -fmodules-prune-interval=86400 -fmodules-validate-once-per-build-session -arch armv7 /var/mobile/TheosProjects/Spotless/.theos/obj/debug/armv7/Tweak.xm.mm -o /var/mobile/TheosProjects/Spotless/.theos/obj/debug/armv7/Tweak.xm.5063494b.o ) make[3]: *** [/var/theos/makefiles/instance/rules.mk:269: /var/mobile/TheosProjects/Spotless/.theos/obj/debug/armv7/Tweak.xm.5063494b.o] Error 137 rm /var/mobile/TheosProjects/Spotless/.theos/obj/debug/armv7/Tweak.xm.mm make[2]: *** [/var/theos/makefiles/instance/library.mk:33: /var/mobile/TheosProjects/Spotless/.theos/obj/debug/armv7/spotless.dylib] Error 2 make[2]: *** Waiting for unfinished jobs.... ==> Compiling Tweak.xm (arm64)… ==> Linking tweak spotless (arm64)… ==> Generating debug symbols for spotless… rm /var/mobile/TheosProjects/Spotless/.theos/obj/debug/arm64/Tweak.xm.mm make[1]: *** [/var/theos/makefiles/instance/library.mk:24: internal-library-all_] Error 2 make: *** [/var/theos/makefiles/master/rules.mk:111: spotless.all.tweak.variables] Error 2 Anyone know how to fix this? Thanks
-
Nice
-
Hack [Update] Clash of Clans bot iOS (AutoClashBotiOS v7.5.0) | Supports iOS 9 ~ 14
Fadexz replied to Harky's topic in DIY Cheats
Nice