-
Posts
303 -
Joined
-
Last visited
Everything posted by Red16
-
Save Game True Skate Hack (All Versions) +4 Cheats!
Red16 replied to --Techarmor--'s topic in Save Game Cheats
Nice -
I’ll look into this
-
Maybe
-
Thanks 😀
-
Dang
-
Thanks
-
Smh
-
Hack WiFi Map (till v4.0.34) [PRO Enabled]
Red16 replied to strejda603's topic in Free Jailbreak Cheats
What dose this do -
Mod Menu Hack [x64] Terraria v1.3.0.7.2 +8 [God Mode & Spawn Item]
Red16 replied to bus991's topic in Free Jailbreak Cheats
This only works on terraria v1.3.0.7 it dose not work on terraria v1.3.0.7.1 -
Mod Menu Hack [x64] Terraria v1.3.0.7.2 +8 [God Mode & Spawn Item]
Red16 replied to bus991's topic in Free Jailbreak Cheats
@busmanl30 Hahahaha I figured it out -
the title says it all i already know how to get the binary/global meta. dat this is what get in il2cppdumper Select Mode: 1.Manual 2.Auto 3.Auto(Advanced) 4.Auto(Plus) legit i something saying i need ida
-
I followed teds arm 64 tut and got watch points watch point 1 hit and I also got alsr and I subtracted LLDB offsets with the alsr and took that to ida and it said jumpask failed. dose this mean watch points are broken on iOS 12.4
-
No luck I tried sdk 9.3/10.3 but I got a new error sdk 11.2 doesn’t work on iOS 12.4 => Linking tweak MrBulletMegaHack (armv7)… ld: file not found: /usr/lib/system/liblaunch.dylib for architecture armv7 clang-5.0: error: linker command failed with exit code 1 (use -v to see invocation) make[3]: *** [/var/theos/makefiles/instance/library.mk:33: /var/mobile/mrbulletmegahack/.theos/obj/armv7/MrBulletMegaHack.dylib] Error 1 ==> Linking tweak MrBulletMegaHack (arm64)… ld: file not found: /usr/lib/system/liblaunch.dylib for architecture arm64 clang-5.0: error: linker command failed with exit code 1 (use -v to see invocation) make[3]: *** [/var/theos/makefiles/instance/library.mk:33: /var/mobile/mrbulletmegahack/.theos/obj/arm64/MrBulletMegaHack.dylib] Error 1 rm /var/mobile/mrbulletmegahack/.theos/obj/arm64/Tweak.xm.mm rm /var/mobile/mrbulletmegahack/.theos/obj/armv7/Tweak.xm.mm make[2]: *** [/var/theos/makefiles/instance/library.mk:33: /var/mobile/mrbulletmegahack/.theos/obj/armv7/MrBulletMegaHack.dylib] Error 2 make[2]: *** Waiting for unfinished jobs.... make[2]: *** [/var/theos/makefiles/instance/library.mk:33: /var/mobile/mrbulletmegahack/.theos/obj/arm64/MrBulletMegaHack.dylib] Error 2 make[1]: *** [/var/theos/makefiles/instance/library.mk:24: internal-library-all_] Error 2 make: *** [/var/theos/makefiles/master/rules.mk:112: MrBulletMegaHack.all.tweak.variables] Error 2
-
I also have this same exact problem I’m on iOS 12.4
-
So I was helping a newbie hack his first game and got this error so how do I fix it, [NOTE] i did not change anything in the tweak.xm or touch any other files ==> Linking bundle MrBulletMegaHack (arm64)… ld: warning: directory not found for option '-F/var/theos/sdks/iPhoneOS9.3.sdk/System/Library/PrivateFrameworks' ld: framework not found Preferences clang-5.0: error: linker command failed with exit code 1 (use -v to see invocation) make[4]: *** [/var/theos/makefiles/instance/bundle.mk:37: /var/mobile/mrbulletmegahack/.theos/obj/arm64/MrBulletMegaHack.bundle/MrBulletMegaHack] Error 1 make[3]: *** [/var/theos/makefiles/instance/bundle.mk:37: /var/mobile/mrbulletmegahack/.theos/obj/arm64/MrBulletMegaHack.bundle/MrBulletMegaHack] Error 2 make[3]: *** Waiting for unfinished jobs.... ==> Linking bundle MrBulletMegaHack (armv7)… ld: warning: directory not found for option '-F/var/theos/sdks/iPhoneOS9.3.sdk/System/Library/PrivateFrameworks' ld: framework not found Preferences clang-5.0: error: linker command failed with exit code 1 (use -v to see invocation) make[4]: *** [/var/theos/makefiles/instance/bundle.mk:37: /var/mobile/mrbulletmegahack/.theos/obj/armv7/MrBulletMegaHack.bundle/MrBulletMegaHack] Error 1 make[3]: *** [/var/theos/makefiles/instance/bundle.mk:37: /var/mobile/mrbulletmegahack/.theos/obj/armv7/MrBulletMegaHack.bundle/MrBulletMegaHack] Error 2 make[2]: *** [/var/theos/makefiles/instance/bundle.mk:26: internal-bundle-all_] Error 2 make[1]: *** [/var/theos/makefiles/master/rules.mk:112: MrBulletMegaHack.all.bundle.variables] Error 2 make: *** [/var/theos/makefiles/master/aggregate.mk:12: internal-all] Error 2
-
Ah thanks