-
Posts
319 -
Joined
-
Last visited
Everything posted by Profq
-
count me in, this is crazy every 3 days for 6 weeks got damn
-
closing this topic, until i figure out a solution
-
i posted a video, that's what the hack does.
-
you should be able to purchase Gems or what they are called in the store
-
This cheat doesn't work so closing it down, sorry, will have an updated version ASAP!
-
didn't work guess somethings wrong with kirbs theos or my phone
-
I know don't know why i get 2 when I install perl from Coolstar
-
hmm, I'm getting that nic.pl isn't in directory and i've searched the forum that its something with perl, every time i install perl i get 2, 2 perl in /usr/local/bin and in /usr/bin one with the name perl and the other one with the name perl5.22.0
-
the folder in vendor/include is empty
-
so I decided to try kirbs theos, so i downloaded Puffin and unzipped the folder in file and renamed it, but the include folder is empty, not sure if it should be like that or i should replace it with another include folder
-
did you rename the thoes-master to just theos or doesn't that matter?
-
did you follow DiDA's TuT with pc or did you manage to install it with MTerminal on your idevice? if you installed it with MTerminal can you send me a pm or here how you installed it
-
what kind of Theos did you install? i installed nix.howetts
-
yeah, when i was on 9.3.3 i used 8.1 SDK but now that i'm on 10.2 it seems to be a problem for me
-
yes i have tried 8.1 to 9.2 and it seems like 9.3 is the only one that works
-
Where can I find information about UIAlertController?
-
if i use a lower one then it shows me "fatal error: #import <pthread.h>"
-
Hello Again, so when I'm trying to compile my tweak the only thing that doesn't want to compile is the UiAlertView. If I delete the Ui and try to compile the tweak with the cheat then it works but when i try to compile with UiAlertView it shows me an error: G-Eazy-Jr:/var/mobile/raft root# make package install Making all for tweak Raft... Preprocessing Tweak.xm... Constants from lexical variables potentially modified elsewhere are deprecated at /private/var/theos/bin/lib/aliased.pm line 42. Constants from lexical variables potentially modified elsewhere are deprecated at /private/var/theos/bin/lib/aliased.pm line 42. Constants from lexical variables potentially modified elsewhere are deprecated at /private/var/theos/bin/lib/aliased.pm line 42. Constants from lexical variables potentially modified elsewhere are deprecated at /private/var/theos/bin/lib/aliased.pm line 42. Constants from lexical variables potentially modified elsewhere are deprecated at /private/var/theos/bin/lib/aliased.pm line 42. Constants from lexical variables potentially modified elsewhere are deprecated at /private/var/theos/bin/lib/aliased.pm line 42. Constants from lexical variables potentially modified elsewhere are deprecated at /private/var/theos/bin/lib/aliased.pm line 42. Constants from lexical variables potentially modified elsewhere are deprecated at /private/var/theos/bin/lib/aliased.pm line 42. Compiling Tweak.xm... Tweak.xm:15:1: error: 'UIAlertView' is deprecated: first deprecated in iOS 9.0 [-Werror,-Wdeprecated-declarations] UIAlertView *alert = [[UIAlertView alloc] ini... ^ /var/mobile/raft/theos/sdks/iPhoneOS9.3.sdk/System/Library/Frameworks/UIKit.framework/Headers/UIAlertView.h:26:12: note: 'UIAlertView' has been explicitly marked deprecated here @interface UIAlertView : UIView ^ Tweak.xm:15:24: error: 'UIAlertView' is deprecated: first deprecated in iOS 9.0 [-Werror,-Wdeprecated-declarations] UIAlertView *alert = [[UIAlertView alloc] ini... ^ /var/mobile/raft/theos/sdks/iPhoneOS9.3.sdk/System/Library/Frameworks/UIKit.framework/Headers/UIAlertView.h:26:12: note: 'UIAlertView' has been explicitly marked deprecated here @interface UIAlertView : UIView ^ 2 errors generated. make[2]: *** [obj/Tweak.xm.49b02bef.o] Error 1 make[1]: *** [internal-library-all_] Error 2 make: *** [Raft.all.tweak.variables] Error 2 G-Eazy-Jr:/var/mobile/raft root
-
Help/Support MTerminal, Fatal error: pthread.h file not found
Profq replied to Profq's topic in Help & Support
fixed it by removing libfauxsu.dylib and fauxsu -
Help/Support MTerminal, Fatal error: pthread.h file not found
Profq replied to Profq's topic in Help & Support
got it from nix.howett.net/theos/ -
Help/Support MTerminal, Fatal error: pthread.h file not found
Profq replied to Profq's topic in Help & Support
G-Eazy-Jr:/var/mobile/raftcheat root# make package me ssages=yes Making all for tweak raftcheat... make -f Makefile --no-print-directory --no-keep-going \ internal-library-compile \ _THEOS_CURRENT_TYPE=tweak THEOS_CURRENT_INSTANCE=raftcheat _THEOS_CURRENT_OPERATION=compile \ THEOS_BUILD_DIR="." _THEOS_MAKE_PARALLEL=yes make[2]: Nothing to be done for `internal-library-compile'. Making all in raftcheat... make[1]: Entering directory `/private/var/mobile/raftcheat/raftcheat' Making all for bundle raftcheat... mkdir -p "obj/raftcheat.bundle/" mkdir -p "obj/raftcheat.bundle/" mkdir -p "obj/raftcheat.bundle/" for d in Resources; do \ if [ -d "$d" ]; then \ rsync -a "$d/" "./obj/raftcheat.bundle/" --exclude "_MTN" --exclude ".git" --exclude ".svn" --exclude ".DS_Store" --exclude "._*"; \ else \ echo "Warning: ignoring missing bundle resource directory $d."; \ fi; \ done make -f Makefile --no-print-directory --no-keep-going \ internal-bundle-compile \ _THEOS_CURRENT_TYPE=bundle THEOS_CURRENT_INSTANCE=raftcheat _THEOS_CURRENT_OPERATION=compile \ THEOS_BUILD_DIR="." _THEOS_MAKE_PARALLEL=yes make[3]: Nothing to be done for `internal-bundle-compile'. make[1]: Leaving directory `/private/var/mobile/raftcheat/raftcheat' rm -rf "/private/var/mobile/raftcheat/_" /var/mobile/raftcheat/theos/bin/fakeroot.sh -p "/private/var/mobile/raftcheat/.theos/fakeroot" -c mkdir -p "/private/var/mobile/raftcheat/_" [ -d layout ] && rsync -a "layout/" "/private/var/mobile/raftcheat/_" --exclude "DEBIAN" --exclude "_MTN" --exclude ".git" --exclude ".svn" --exclude ".DS_Store" --exclude "._*" || true Making stage for tweak raftcheat... mkdir -p "/private/var/mobile/raftcheat/_/Library/MobileSubstrate/DynamicLibraries/" cp ./obj/raftcheat.dylib "/private/var/mobile/raftcheat/_/Library/MobileSubstrate/DynamicLibraries/" if [ -f raftcheat.plist ]; then cp raftcheat.plist "/private/var/mobile/raftcheat/_/Library/MobileSubstrate/DynamicLibraries/"; fi Making stage in raftcheat... make[1]: Entering directory `/private/var/mobile/raftcheat/raftcheat' [ -d layout ] && rsync -a "layout/" "/private/var/mobile/raftcheat/_" --exclude "DEBIAN" --exclude "_MTN" --exclude ".git" --exclude ".svn" --exclude ".DS_Store" --exclude "._*" || true Making stage for bundle raftcheat... mkdir -p "/private/var/mobile/raftcheat/_/Library/PreferenceBundles/raftcheat.bundle" rsync -a "./obj/raftcheat.bundle/" "/private/var/mobile/raftcheat/_/Library/PreferenceBundles/raftcheat.bundle" mkdir -p /private/var/mobile/raftcheat/_/Library/PreferenceLoader/Preferences cp entry.plist /private/var/mobile/raftcheat/_/Library/PreferenceLoader/Preferences/raftcheat.plist make[1]: Leaving directory `/private/var/mobile/raftcheat/raftcheat' mkdir -p "/private/var/mobile/raftcheat/_/DEBIAN" sed -e '/^[Vv]ersion:/d' "/private/var/mobile/raftcheat/control" > "/private/var/mobile/raftcheat/_/DEBIAN/control" echo "Version: 1.0.0-2" >> "/private/var/mobile/raftcheat/_/DEBIAN/control" echo "Installed-Size: 328" >> "/private/var/mobile/raftcheat/_/DEBIAN/control" COPYFILE_DISABLE=1 /var/mobile/raftcheat/theos/bin/fakeroot.sh -p "/private/var/mobile/raftcheat/.theos/fakeroot" -r dpkg-deb -b "/private/var/mobile/raftcheat/_" "./frank_1.0.0-2_iphoneos-arm.deb" dyld: could not load inserted library '/var/mobile/raftcheat/theos/bin/libfauxsu.dylib' because no suitable image found. Did find: /var/mobile/raftcheat/theos/bin/libfauxsu.dylib: required code signature missing for '/var/mobile/raftcheat/theos/bin/libfauxsu.dylib' /var/mobile/raftcheat/theos/bin/fauxsu: line 43: 25071 Abort trap: 6 "$@" make: *** [internal-package] Error 134 -
Help/Support MTerminal, Fatal error: pthread.h file not found
Profq replied to Profq's topic in Help & Support
tried that now im getting something with error 134 G-Eazy-Jr:/var/mobile/raftcheat root# make package in stall Making all for tweak raftcheat... make[2]: Nothing to be done for `internal-library-compile'. Making all in raftcheat... Making all for bundle raftcheat... Copying resource directories into the bundle wrapper... Linking bundle raftcheat... Stripping raftcheat... Signing raftcheat... Making stage for tweak raftcheat... Making stage in raftcheat... Making stage for bundle raftcheat... make: *** [internal-package] Error 134 G-Eazy-Jr:/var/mobile/raftcheat root# -
Help/Support MTerminal, Fatal error: pthread.h file not found
Profq replied to Profq's topic in Help & Support
yup, i have 9.2SDK im getting an error if i use 9.3SDK
