Jump to content

3 posts in this topic

Recommended Posts

Posted

Hello everyone, I recently ran into a problem like Error 2 in Theos
I tried to compile on the phone, but I failed because theos does not work with taurine 14.3 with sunstorm rollback (or I tried it badly)
I tried to compile on linux, but there was error 2, and on windows, first through the ubuntu terminal where I tried to move the sdk to the sdks/ folder and the 255 character limit in the windows path stopped me with an error, I also tried through cygwin64, but there I failed

I tried to compile a regular ted2 mmt, via the sdk iPhone11,2, but it was broken (probably), I wanted to download the sdk from github, but it wasn't there, are there people who could help me with my problem?

Posted

Can you post the full output of `make package messages=yes` command?

Posted

$ make package
===> Setting SYSROOT to /home/1/theos/sdks/iPhoneOS11.2.sdk/...
> Making all for tweak Standoff2…
===> Setting SYSROOT to /home/1/theos/sdks/iPhoneOS11.2.sdk/...
===> Setting SYSROOT to /home/1/theos/sdks/iPhoneOS11.2.sdk/...
===> Setting SYSROOT to /home/1/theos/sdks/iPhoneOS11.2.sdk/...
==> Preprocessing Tweak.xm…
==> Compiling KittyMemory/KittyMemory.cpp (arm64)…
While building module 'Darwin' imported from KittyMemory/KittyMemory.hpp:12:
In file included from <module-includes>:215:
/home/1/theos/sdks/iPhoneOS11.2.sdk/usr/include/pthread.h:1:1: error: unknown type name 'pthread'; did you mean 'pthread_t'?
pthread/pthread.h
^
/home/1/theos/sdks/iPhoneOS11.2.sdk/usr/include/sys/_pthread/_pthread_t.h:31:28: note: 'pthread_t' declared here
typedef __darwin_pthread_t pthread_t;
                           ^
While building module 'Darwin' imported from KittyMemory/KittyMemory.hpp:12:
In file included from <module-includes>:215:
/home/1/theos/sdks/iPhoneOS11.2.sdk/usr/include/pthread.h:1:8: error: expected unqualified-id
pthread/pthread.h
       ^
While building module 'Darwin' imported from KittyMemory/KittyMemory.hpp:12:
In file included from <module-includes>:218:
/home/1/theos/sdks/iPhoneOS11.2.sdk/usr/include/pthread_impl.h:1:1: error: unknown type name 'pthread'; did you mean 'pthread_t'?
pthread/pthread_impl.h
^
/home/1/theos/sdks/iPhoneOS11.2.sdk/usr/include/sys/_pthread/_pthread_t.h:31:28: note: 'pthread_t' declared here
typedef __darwin_pthread_t pthread_t;
                           ^
While building module 'Darwin' imported from KittyMemory/KittyMemory.hpp:12:
In file included from <module-includes>:218:
/home/1/theos/sdks/iPhoneOS11.2.sdk/usr/include/pthread_impl.h:1:8: error: expected unqualified-id
pthread/pthread_impl.h
       ^
While building module 'Darwin' imported from KittyMemory/KittyMemory.hpp:12:
In file included from <module-includes>:224:
/home/1/theos/sdks/iPhoneOS11.2.sdk/usr/include/pthread_spis.h:1:1: error: unknown type name 'pthread'; did you mean 'pthread_t'?
pthread/pthread_spis.h
^
/home/1/theos/sdks/iPhoneOS11.2.sdk/usr/include/sys/_pthread/_pthread_t.h:31:28: note: 'pthread_t' declared here
typedef __darwin_pthread_t pthread_t;
                           ^
While building module 'Darwin' imported from KittyMemory/KittyMemory.hpp:12:
In file included from <module-includes>:224:
/home/1/theos/sdks/iPhoneOS11.2.sdk/usr/include/pthread_spis.h:1:8: error: expected unqualified-id
pthread/pthread_spis.h
       ^
While building module 'Darwin' imported from KittyMemory/KittyMemory.hpp:12:
In file included from <module-includes>:227:
In file included from /home/1/theos/sdks/iPhoneOS11.2.sdk/usr/include/pthread/spawn.h:32:
In file included from /home/1/theos/sdks/iPhoneOS11.2.sdk/usr/include/pthread/pthread.h:59:
In file included from /home/1/theos/sdks/iPhoneOS11.2.sdk/usr/include/pthread/sched.h:28:
/home/1/theos/sdks/iPhoneOS11.2.sdk/usr/include/pthread_impl.h:1:1: error: unknown type name 'pthread'; did you mean 'pthread_t'?
pthread/pthread_impl.h
^
/home/1/theos/sdks/iPhoneOS11.2.sdk/usr/include/sys/_pthread/_pthread_t.h:31:28: note: 'pthread_t' declared here
typedef __darwin_pthread_t pthread_t;
                           ^
While building module 'Darwin' imported from KittyMemory/KittyMemory.hpp:12:
In file included from <module-includes>:227:
In file included from /home/1/theos/sdks/iPhoneOS11.2.sdk/usr/include/pthread/spawn.h:32:
In file included from /home/1/theos/sdks/iPhoneOS11.2.sdk/usr/include/pthread/pthread.h:59:
In file included from /home/1/theos/sdks/iPhoneOS11.2.sdk/usr/include/pthread/sched.h:28:
/home/1/theos/sdks/iPhoneOS11.2.sdk/usr/include/pthread_impl.h:1:8: error: expected unqualified-id
pthread/pthread_impl.h
       ^
While building module 'Darwin' imported from KittyMemory/KittyMemory.hpp:12:
In file included from <module-includes>:236:
/home/1/theos/sdks/iPhoneOS11.2.sdk/usr/include/sched.h:1:1: error: unknown type name 'pthread'; did you mean 'pthread_t'?
pthread/sched.h
^
/home/1/theos/sdks/iPhoneOS11.2.sdk/usr/include/sys/_pthread/_pthread_t.h:31:28: note: 'pthread_t' declared here
typedef __darwin_pthread_t pthread_t;
                           ^
While building module 'Darwin' imported from KittyMemory/KittyMemory.hpp:12:
In file included from <module-includes>:236:
/home/1/theos/sdks/iPhoneOS11.2.sdk/usr/include/sched.h:1:8: error: expected unqualified-id
pthread/sched.h
       ^
In file included from KittyMemory/KittyMemory.cpp:9:
KittyMemory/KittyMemory.hpp:12:10: fatal error: could not build module 'Darwin'
#include <stdio.h>
 ~~~~~~~~^
While building module 'MachO' imported from KittyMemory/KittyMemory.hpp:16:
In file included from <module-includes>:2:
/home/1/theos/sdks/iPhoneOS11.2.sdk/usr/include/mach-o/arch.h:32:10: fatal error: could not build module 'Darwin'
#include <stdint.h>
 ~~~~~~~~^
While building module 'libkern' imported from KittyMemory/KittyMemory.hpp:18:
In file included from <module-includes>:2:
/home/1/theos/sdks/iPhoneOS11.2.sdk/usr/include/libkern/OSCacheControl.h:27:13: fatal error: could not build module 'Darwin'
#include    <stddef.h>
 ~~~~~~~~~~~^
While building module 'ObjectiveC' imported from /home/1/theos/vendor/include/substrate.h:50:
In file included from <module-includes>:2:
In file included from /home/1/theos/sdks/iPhoneOS11.2.sdk/usr/include/objc/./message.h:27:
/home/1/theos/sdks/iPhoneOS11.2.sdk/usr/include/objc/objc.h:31:10: fatal error: could not build module 'Darwin'
#include <sys/types.h>      // for __DARWIN_NULL
 ~~~~~~~~^
14 errors generated.
make[3]: *** [/home/1/theos/makefiles/instance/rules.mk:241: /home/1/standoff2/.theos/obj/arm64/KittyMemory/KittyMemory.cpp.f1450fb4.o] Error 1
make[3]: *** Waiting for unfinished jobs....
==> Compiling KittyMemory/MemoryPatch.cpp (arm64)…
While building module 'Darwin' imported from /home/1/theos/include/bits/os_defines.h:61:
In file included from <module-includes>:215:
/home/1/theos/sdks/iPhoneOS11.2.sdk/usr/include/pthread.h:1:1: error: unknown type name 'pthread'; did you mean 'pthread_t'?
pthread/pthread.h
^
/home/1/theos/sdks/iPhoneOS11.2.sdk/usr/include/sys/_pthread/_pthread_t.h:31:28: note: 'pthread_t' declared here
typedef __darwin_pthread_t pthread_t;
                           ^
While building module 'Darwin' imported from /home/1/theos/include/bits/os_defines.h:61:
In file included from <module-includes>:215:
/home/1/theos/sdks/iPhoneOS11.2.sdk/usr/include/pthread.h:1:8: error: expected unqualified-id
pthread/pthread.h
       ^
While building module 'Darwin' imported from /home/1/theos/include/bits/os_defines.h:61:
In file included from <module-includes>:218:
/home/1/theos/sdks/iPhoneOS11.2.sdk/usr/include/pthread_impl.h:1:1: error: unknown type name 'pthread'; did you mean 'pthread_t'?
pthread/pthread_impl.h
^
/home/1/theos/sdks/iPhoneOS11.2.sdk/usr/include/sys/_pthread/_pthread_t.h:31:28: note: 'pthread_t' declared here
typedef __darwin_pthread_t pthread_t;
                           ^
While building module 'Darwin' imported from /home/1/theos/include/bits/os_defines.h:61:
In file included from <module-includes>:218:
/home/1/theos/sdks/iPhoneOS11.2.sdk/usr/include/pthread_impl.h:1:8: error: expected unqualified-id
pthread/pthread_impl.h
       ^
While building module 'Darwin' imported from /home/1/theos/include/bits/os_defines.h:61:
In file included from <module-includes>:224:
/home/1/theos/sdks/iPhoneOS11.2.sdk/usr/include/pthread_spis.h:1:1: error: unknown type name 'pthread'; did you mean 'pthread_t'?
pthread/pthread_spis.h
^
/home/1/theos/sdks/iPhoneOS11.2.sdk/usr/include/sys/_pthread/_pthread_t.h:31:28: note: 'pthread_t' declared here
typedef __darwin_pthread_t pthread_t;
                           ^
While building module 'Darwin' imported from /home/1/theos/include/bits/os_defines.h:61:
In file included from <module-includes>:224:
/home/1/theos/sdks/iPhoneOS11.2.sdk/usr/include/pthread_spis.h:1:8: error: expected unqualified-id
pthread/pthread_spis.h
       ^
While building module 'Darwin' imported from /home/1/theos/include/bits/os_defines.h:61:
In file included from <module-includes>:227:
In file included from /home/1/theos/sdks/iPhoneOS11.2.sdk/usr/include/pthread/spawn.h:32:
In file included from /home/1/theos/sdks/iPhoneOS11.2.sdk/usr/include/pthread/pthread.h:59:
In file included from /home/1/theos/sdks/iPhoneOS11.2.sdk/usr/include/pthread/sched.h:28:
/home/1/theos/sdks/iPhoneOS11.2.sdk/usr/include/pthread_impl.h:1:1: error: unknown type name 'pthread'; did you mean 'pthread_t'?
pthread/pthread_impl.h
^
/home/1/theos/sdks/iPhoneOS11.2.sdk/usr/include/sys/_pthread/_pthread_t.h:31:28: note: 'pthread_t' declared here
typedef __darwin_pthread_t pthread_t;
                           ^
While building module 'Darwin' imported from /home/1/theos/include/bits/os_defines.h:61:
In file included from <module-includes>:227:
In file included from /home/1/theos/sdks/iPhoneOS11.2.sdk/usr/include/pthread/spawn.h:32:
In file included from /home/1/theos/sdks/iPhoneOS11.2.sdk/usr/include/pthread/pthread.h:59:
In file included from /home/1/theos/sdks/iPhoneOS11.2.sdk/usr/include/pthread/sched.h:28:
/home/1/theos/sdks/iPhoneOS11.2.sdk/usr/include/pthread_impl.h:1:8: error: expected unqualified-id
pthread/pthread_impl.h
       ^
While building module 'Darwin' imported from /home/1/theos/include/bits/os_defines.h:61:
In file included from <module-includes>:236:
/home/1/theos/sdks/iPhoneOS11.2.sdk/usr/include/sched.h:1:1: error: unknown type name 'pthread'; did you mean 'pthread_t'?
pthread/sched.h
^
/home/1/theos/sdks/iPhoneOS11.2.sdk/usr/include/sys/_pthread/_pthread_t.h:31:28: note: 'pthread_t' declared here
typedef __darwin_pthread_t pthread_t;
                           ^
While building module 'Darwin' imported from /home/1/theos/include/bits/os_defines.h:61:
In file included from <module-includes>:236:
/home/1/theos/sdks/iPhoneOS11.2.sdk/usr/include/sched.h:1:8: error: expected unqualified-id
pthread/sched.h
       ^
In file included from KittyMemory/MemoryPatch.cpp:7:
In file included from KittyMemory/MemoryPatch.hpp:9:
In file included from /home/1/theos/include/vector:65:
In file included from /home/1/theos/include/bits/functexcept.h:41:
In file included from /home/1/theos/include/bits/c++config.h:41:
/home/1/theos/include/bits/os_defines.h:61:10: fatal error: could not build module 'Darwin'
#include <unistd.h>
 ~~~~~~~~^
While building module 'MachO' imported from KittyMemory/KittyMemory.hpp:16:
In file included from <module-includes>:2:
/home/1/theos/sdks/iPhoneOS11.2.sdk/usr/include/mach-o/arch.h:32:10: fatal error: could not build module 'Darwin'
#include <stdint.h>
 ~~~~~~~~^
While building module 'libkern' imported from KittyMemory/KittyMemory.hpp:18:
In file included from <module-includes>:2:
/home/1/theos/sdks/iPhoneOS11.2.sdk/usr/include/libkern/OSCacheControl.h:27:13: fatal error: could not build module 'Darwin'
#include    <stddef.h>
 ~~~~~~~~~~~^
13 errors generated.
make[3]: *** [/home/1/theos/makefiles/instance/rules.mk:241: /home/1/standoff2/.theos/obj/arm64/KittyMemory/MemoryPatch.cpp.f1450fb4.o] Error 1
==> Compiling KittyMemory/KittyUtils.cpp (arm64)…
While building module 'Darwin' imported from /home/1/theos/include/bits/os_defines.h:61:
In file included from <module-includes>:215:
/home/1/theos/sdks/iPhoneOS11.2.sdk/usr/include/pthread.h:1:1: error: unknown type name 'pthread'; did you mean 'pthread_t'?
pthread/pthread.h
^
/home/1/theos/sdks/iPhoneOS11.2.sdk/usr/include/sys/_pthread/_pthread_t.h:31:28: note: 'pthread_t' declared here
typedef __darwin_pthread_t pthread_t;
                           ^
While building module 'Darwin' imported from /home/1/theos/include/bits/os_defines.h:61:
In file included from <module-includes>:215:
/home/1/theos/sdks/iPhoneOS11.2.sdk/usr/include/pthread.h:1:8: error: expected unqualified-id
pthread/pthread.h
       ^
While building module 'Darwin' imported from /home/1/theos/include/bits/os_defines.h:61:
In file included from <module-includes>:218:
/home/1/theos/sdks/iPhoneOS11.2.sdk/usr/include/pthread_impl.h:1:1: error: unknown type name 'pthread'; did you mean 'pthread_t'?
pthread/pthread_impl.h
^
/home/1/theos/sdks/iPhoneOS11.2.sdk/usr/include/sys/_pthread/_pthread_t.h:31:28: note: 'pthread_t' declared here
typedef __darwin_pthread_t pthread_t;
                           ^
While building module 'Darwin' imported from /home/1/theos/include/bits/os_defines.h:61:
In file included from <module-includes>:218:
/home/1/theos/sdks/iPhoneOS11.2.sdk/usr/include/pthread_impl.h:1:8: error: expected unqualified-id
pthread/pthread_impl.h
       ^
While building module 'Darwin' imported from /home/1/theos/include/bits/os_defines.h:61:
In file included from <module-includes>:224:
/home/1/theos/sdks/iPhoneOS11.2.sdk/usr/include/pthread_spis.h:1:1: error: unknown type name 'pthread'; did you mean 'pthread_t'?
pthread/pthread_spis.h
^
/home/1/theos/sdks/iPhoneOS11.2.sdk/usr/include/sys/_pthread/_pthread_t.h:31:28: note: 'pthread_t' declared here
typedef __darwin_pthread_t pthread_t;
                           ^
While building module 'Darwin' imported from /home/1/theos/include/bits/os_defines.h:61:
In file included from <module-includes>:224:
/home/1/theos/sdks/iPhoneOS11.2.sdk/usr/include/pthread_spis.h:1:8: error: expected unqualified-id
pthread/pthread_spis.h
       ^
While building module 'Darwin' imported from /home/1/theos/include/bits/os_defines.h:61:
In file included from <module-includes>:227:
In file included from /home/1/theos/sdks/iPhoneOS11.2.sdk/usr/include/pthread/spawn.h:32:
In file included from /home/1/theos/sdks/iPhoneOS11.2.sdk/usr/include/pthread/pthread.h:59:
In file included from /home/1/theos/sdks/iPhoneOS11.2.sdk/usr/include/pthread/sched.h:28:
/home/1/theos/sdks/iPhoneOS11.2.sdk/usr/include/pthread_impl.h:1:1: error: unknown type name 'pthread'; did you mean 'pthread_t'?
pthread/pthread_impl.h
^
/home/1/theos/sdks/iPhoneOS11.2.sdk/usr/include/sys/_pthread/_pthread_t.h:31:28: note: 'pthread_t' declared here
typedef __darwin_pthread_t pthread_t;
                           ^
While building module 'Darwin' imported from /home/1/theos/include/bits/os_defines.h:61:
In file included from <module-includes>:227:
In file included from /home/1/theos/sdks/iPhoneOS11.2.sdk/usr/include/pthread/spawn.h:32:
In file included from /home/1/theos/sdks/iPhoneOS11.2.sdk/usr/include/pthread/pthread.h:59:
In file included from /home/1/theos/sdks/iPhoneOS11.2.sdk/usr/include/pthread/sched.h:28:
/home/1/theos/sdks/iPhoneOS11.2.sdk/usr/include/pthread_impl.h:1:8: error: expected unqualified-id
pthread/pthread_impl.h
       ^
While building module 'Darwin' imported from /home/1/theos/include/bits/os_defines.h:61:
In file included from <module-includes>:236:
/home/1/theos/sdks/iPhoneOS11.2.sdk/usr/include/sched.h:1:1: error: unknown type name 'pthread'; did you mean 'pthread_t'?
pthread/sched.h
^
/home/1/theos/sdks/iPhoneOS11.2.sdk/usr/include/sys/_pthread/_pthread_t.h:31:28: note: 'pthread_t' declared here
typedef __darwin_pthread_t pthread_t;
                           ^
While building module 'Darwin' imported from /home/1/theos/include/bits/os_defines.h:61:
In file included from <module-includes>:236:
/home/1/theos/sdks/iPhoneOS11.2.sdk/usr/include/sched.h:1:8: error: expected unqualified-id
pthread/sched.h
       ^
In file included from KittyMemory/KittyUtils.cpp:1:
In file included from KittyMemory/KittyUtils.hpp:3:
In file included from /home/1/theos/include/string:45:
In file included from /home/1/theos/include/bits/c++config.h:41:
/home/1/theos/include/bits/os_defines.h:61:10: fatal error: could not build module 'Darwin'
#include <unistd.h>
 ~~~~~~~~^
11 errors generated.
make[3]: *** [/home/1/theos/makefiles/instance/rules.mk:241: /home/1/standoff2/.theos/obj/arm64/KittyMemory/KittyUtils.cpp.f1450fb4.o] Error 1
==> Compiling Menu.mm (arm64)…
While building module 'Darwin' imported from /home/1/theos/Prefix.pch:24:
In file included from <module-includes>:215:
/home/1/theos/sdks/iPhoneOS11.2.sdk/usr/include/pthread.h:1:1: error: unknown type name 'pthread'; did you mean 'pthread_t'?
pthread/pthread.h
^
/home/1/theos/sdks/iPhoneOS11.2.sdk/usr/include/sys/_pthread/_pthread_t.h:31:28: note: 'pthread_t' declared here
typedef __darwin_pthread_t pthread_t;
                           ^
While building module 'Darwin' imported from /home/1/theos/Prefix.pch:24:
In file included from <module-includes>:215:
/home/1/theos/sdks/iPhoneOS11.2.sdk/usr/include/pthread.h:1:8: error: expected unqualified-id
pthread/pthread.h
       ^
While building module 'Darwin' imported from /home/1/theos/Prefix.pch:24:
In file included from <module-includes>:218:
/home/1/theos/sdks/iPhoneOS11.2.sdk/usr/include/pthread_impl.h:1:1: error: unknown type name 'pthread'; did you mean 'pthread_t'?
pthread/pthread_impl.h
^
/home/1/theos/sdks/iPhoneOS11.2.sdk/usr/include/sys/_pthread/_pthread_t.h:31:28: note: 'pthread_t' declared here
typedef __darwin_pthread_t pthread_t;
                           ^
While building module 'Darwin' imported from /home/1/theos/Prefix.pch:24:
In file included from <module-includes>:218:
/home/1/theos/sdks/iPhoneOS11.2.sdk/usr/include/pthread_impl.h:1:8: error: expected unqualified-id
pthread/pthread_impl.h
       ^
While building module 'Darwin' imported from /home/1/theos/Prefix.pch:24:
In file included from <module-includes>:224:
/home/1/theos/sdks/iPhoneOS11.2.sdk/usr/include/pthread_spis.h:1:1: error: unknown type name 'pthread'; did you mean 'pthread_t'?
pthread/pthread_spis.h
^
/home/1/theos/sdks/iPhoneOS11.2.sdk/usr/include/sys/_pthread/_pthread_t.h:31:28: note: 'pthread_t' declared here
typedef __darwin_pthread_t pthread_t;
                           ^
While building module 'Darwin' imported from /home/1/theos/Prefix.pch:24:
In file included from <module-includes>:224:
/home/1/theos/sdks/iPhoneOS11.2.sdk/usr/include/pthread_spis.h:1:8: error: expected unqualified-id
pthread/pthread_spis.h
       ^
While building module 'Darwin' imported from /home/1/theos/Prefix.pch:24:
In file included from <module-includes>:236:
/home/1/theos/sdks/iPhoneOS11.2.sdk/usr/include/sched.h:1:1: error: unknown type name 'pthread'; did you mean 'pthread_t'?
pthread/sched.h
^
/home/1/theos/sdks/iPhoneOS11.2.sdk/usr/include/sys/_pthread/_pthread_t.h:31:28: note: 'pthread_t' declared here
typedef __darwin_pthread_t pthread_t;
                           ^
While building module 'Darwin' imported from /home/1/theos/Prefix.pch:24:
In file included from <module-includes>:236:
/home/1/theos/sdks/iPhoneOS11.2.sdk/usr/include/sched.h:1:8: error: expected unqualified-id
pthread/sched.h
       ^
In file included from <built-in>:1:
/home/1/theos/Prefix.pch:24:12: fatal error: could not build module 'Darwin'
                        #import <TargetConditionals.h>
                         ~~~~~~~^
While building module 'Foundation' imported from Menu.mm:9:
While building module 'CoreFoundation' imported from /home/1/theos/sdks/iPhoneOS11.2.sdk/System/Library/Frameworks/Foundation.framework/Headers/Foundation.h:6:
In file included from <module-includes>:2:
/home/1/theos/sdks/iPhoneOS11.2.sdk/System/Library/Frameworks/CoreFoundation.framework/Headers/CoreFoundation.h:16:10: fatal error: could not build module 'Darwin'
#include <sys/types.h>
 ~~~~~~~~^
While building module 'Foundation' imported from Menu.mm:9:
While building module 'CoreFoundation' imported from /home/1/theos/sdks/iPhoneOS11.2.sdk/System/Library/Frameworks/Foundation.framework/Headers/Foundation.h:6:
While building module 'Dispatch' imported from /home/1/theos/sdks/iPhoneOS11.2.sdk/System/Library/Frameworks/CoreFoundation.framework/Headers/CFStream.h:20:
In file included from <module-includes>:2:
/home/1/theos/sdks/iPhoneOS11.2.sdk/usr/include/dispatch/dispatch.h:25:10: fatal error: could not build module 'Darwin'
#include <Availability.h>
 ~~~~~~~~^
While building module 'Foundation' imported from Menu.mm:9:
While building module 'CoreFoundation' imported from /home/1/theos/sdks/iPhoneOS11.2.sdk/System/Library/Frameworks/Foundation.framework/Headers/Foundation.h:6:
While building module 'Dispatch' imported from /home/1/theos/sdks/iPhoneOS11.2.sdk/System/Library/Frameworks/CoreFoundation.framework/Headers/CFStream.h:20:
While building module 'os_object' imported from /home/1/theos/sdks/iPhoneOS11.2.sdk/usr/include/dispatch/dispatch.h:59:
In file included from <module-includes>:2:
/home/1/theos/sdks/iPhoneOS11.2.sdk/usr/include/os/object.h:25:10: fatal error: could not build module 'Darwin'
#include <Availability.h>
 ~~~~~~~~^
While building module 'Foundation' imported from Menu.mm:9:
In file included from <module-includes>:2:
/home/1/theos/sdks/iPhoneOS11.2.sdk/System/Library/Frameworks/Foundation.framework/Headers/Foundation.h:6:10: fatal error: could not build module 'CoreFoundation'
#include <CoreFoundation/CoreFoundation.h>
 ~~~~~~~~^
While building module 'Foundation' imported from Menu.mm:9:
While building module 'ObjectiveC' imported from /home/1/theos/sdks/iPhoneOS11.2.sdk/System/Library/Frameworks/Foundation.framework/Headers/NSObject.h:6:
In file included from <module-includes>:2:
In file included from /home/1/theos/sdks/iPhoneOS11.2.sdk/usr/include/objc/./message.h:27:
/home/1/theos/sdks/iPhoneOS11.2.sdk/usr/include/objc/objc.h:31:10: fatal error: could not build module 'Darwin'
#include <sys/types.h>      // for __DARWIN_NULL
 ~~~~~~~~^
While building module 'Foundation' imported from Menu.mm:9:
While building module 'Security' imported from /home/1/theos/sdks/iPhoneOS11.2.sdk/System/Library/Frameworks/Foundation.framework/Headers/NSURLCredential.h:9:
In file included from <module-includes>:2:
In file included from /home/1/theos/sdks/iPhoneOS11.2.sdk/System/Library/Frameworks/Security.framework/Headers/Security.h:27:
/home/1/theos/sdks/iPhoneOS11.2.sdk/System/Library/Frameworks/Security.framework/Headers/SecBase.h:27:10: fatal error: could not build module 'Darwin'
#include <TargetConditionals.h>
 ~~~~~~~~^
While building module 'UIKit' imported from ./Menu.h:9:
In file included from <module-includes>:2:
In file included from /home/1/theos/sdks/iPhoneOS11.2.sdk/System/Library/Frameworks/UIKit.framework/Headers/UIKit.h:8:
/home/1/theos/sdks/iPhoneOS11.2.sdk/System/Library/Frameworks/UIKit.framework/Headers/UIKitDefines.h:8:9: fatal error: could not build module 'Darwin'
#import <Availability.h>
 ~~~~~~~^
While building module 'UIKit' imported from ./Menu.h:9:
While building module 'CoreGraphics' imported from /home/1/theos/sdks/iPhoneOS11.2.sdk/System/Library/Frameworks/UIKit.framework/Headers/UIAccessibility.h:9:
In file included from <module-includes>:2:
In file included from /home/1/theos/sdks/iPhoneOS11.2.sdk/System/Library/Frameworks/CoreGraphics.framework/Headers/CoreGraphics.h:8:
/home/1/theos/sdks/iPhoneOS11.2.sdk/System/Library/Frameworks/CoreGraphics.framework/Headers/CGBase.h:8:10: fatal error: could not build module 'Darwin'
#include <stdbool.h>
 ~~~~~~~~^
While building module 'UIKit' imported from ./Menu.h:9:
While building module 'QuartzCore' imported from /home/1/theos/sdks/iPhoneOS11.2.sdk/System/Library/Frameworks/UIKit.framework/Headers/UIView.h:9:
In file included from <module-includes>:1:
In file included from /home/1/theos/sdks/iPhoneOS11.2.sdk/System/Library/Frameworks/QuartzCore.framework/Headers/QuartzCore.h:9:
In file included from /home/1/theos/sdks/iPhoneOS11.2.sdk/System/Library/Frameworks/QuartzCore.framework/Headers/CoreAnimation.h:9:
/home/1/theos/sdks/iPhoneOS11.2.sdk/System/Library/Frameworks/QuartzCore.framework/Headers/CABase.h:11:10: fatal error: could not build module 'Darwin'
#include <stdbool.h>
 ~~~~~~~~^
While building module 'UIKit' imported from ./Menu.h:9:
While building module 'QuartzCore' imported from /home/1/theos/sdks/iPhoneOS11.2.sdk/System/Library/Frameworks/UIKit.framework/Headers/UIView.h:9:
While building module 'OpenGLES' imported from /home/1/theos/sdks/iPhoneOS11.2.sdk/System/Library/Frameworks/QuartzCore.framework/Headers/CAEAGLLayer.h:7:
In file included from <module-includes>:2:
/home/1/theos/sdks/iPhoneOS11.2.sdk/System/Library/Frameworks/OpenGLES.framework/Headers/EAGL.h:8:10: fatal error: could not build module 'Foundation'
#include <Foundation/Foundation.h>
 ~~~~~~~~^
While building module 'UIKit' imported from ./Menu.h:9:
While building module 'QuartzCore' imported from /home/1/theos/sdks/iPhoneOS11.2.sdk/System/Library/Frameworks/UIKit.framework/Headers/UIView.h:9:
While building module 'Metal' imported from /home/1/theos/sdks/iPhoneOS11.2.sdk/System/Library/Frameworks/QuartzCore.framework/Headers/CAMetalLayer.h:7:
In file included from <module-includes>:2:
In file included from /home/1/theos/sdks/iPhoneOS11.2.sdk/System/Library/Frameworks/Metal.framework/Headers/Metal.h:8:
/home/1/theos/sdks/iPhoneOS11.2.sdk/System/Library/Frameworks/Metal.framework/Headers/MTLDefines.h:8:9: fatal error: could not build module 'Darwin'
#import <Availability.h>
 ~~~~~~~^
While building module 'UIKit' imported from ./Menu.h:9:
While building module 'QuartzCore' imported from /home/1/theos/sdks/iPhoneOS11.2.sdk/System/Library/Frameworks/UIKit.framework/Headers/UIView.h:9:
While building module 'Metal' imported from /home/1/theos/sdks/iPhoneOS11.2.sdk/System/Library/Frameworks/QuartzCore.framework/Headers/CAMetalLayer.h:7:
While building module 'IOSurface' imported from /home/1/theos/sdks/iPhoneOS11.2.sdk/System/Library/Frameworks/Metal.framework/Headers/MTLTexture.h:15:
In file included from <module-includes>:2:
/home/1/theos/sdks/iPhoneOS11.2.sdk/System/Library/Frameworks/IOSurface.framework/Headers/IOSurfaceBase.h:12:10: fatal error: could not build module 'Darwin'
#include <sys/cdefs.h>
 ~~~~~~~~^
While building module 'UIKit' imported from ./Menu.h:9:
While building module 'CoreImage' imported from /home/1/theos/sdks/iPhoneOS11.2.sdk/System/Library/Frameworks/UIKit.framework/Headers/UIColor.h:11:
In file included from <module-includes>:2:
In file included from /home/1/theos/sdks/iPhoneOS11.2.sdk/System/Library/Frameworks/CoreImage.framework/Headers/CoreImage.h:8:
/home/1/theos/sdks/iPhoneOS11.2.sdk/System/Library/Frameworks/CoreImage.framework/Headers/CoreImageDefines.h:10:10: fatal error: could not build module 'Darwin'
#include <TargetConditionals.h>
 ~~~~~~~~^
While building module 'UIKit' imported from ./Menu.h:9:
While building module 'CoreImage' imported from /home/1/theos/sdks/iPhoneOS11.2.sdk/System/Library/Frameworks/UIKit.framework/Headers/UIColor.h:11:
While building module 'CoreVideo' imported from /home/1/theos/sdks/iPhoneOS11.2.sdk/System/Library/Frameworks/CoreImage.framework/Headers/CIImage.h:10:
In file included from <module-includes>:2:
/home/1/theos/sdks/iPhoneOS11.2.sdk/System/Library/Frameworks/CoreVideo.framework/Headers/CoreVideo.h:16:10: fatal error: could not build module 'Darwin'
#include <TargetConditionals.h>
 ~~~~~~~~^
While building module 'UIKit' imported from ./Menu.h:9:
While building module 'CoreImage' imported from /home/1/theos/sdks/iPhoneOS11.2.sdk/System/Library/Frameworks/UIKit.framework/Headers/UIColor.h:11:
While building module 'ImageIO' imported from /home/1/theos/sdks/iPhoneOS11.2.sdk/System/Library/Frameworks/CoreImage.framework/Headers/CIImage.h:11:
In file included from <module-includes>:2:
In file included from /home/1/theos/sdks/iPhoneOS11.2.sdk/System/Library/Frameworks/ImageIO.framework/Headers/ImageIO.h:10:
/home/1/theos/sdks/iPhoneOS11.2.sdk/System/Library/Frameworks/ImageIO.framework/Headers/ImageIOBase.h:11:10: fatal error: could not build module 'CoreFoundation'
#include <CoreFoundation/CoreFoundation.h>
 ~~~~~~~~^
While building module 'UIKit' imported from ./Menu.h:9:
While building module 'CoreText' imported from /home/1/theos/sdks/iPhoneOS11.2.sdk/System/Library/Frameworks/UIKit.framework/Headers/NSText.h:10:
In file included from <module-includes>:2:
In file included from /home/1/theos/sdks/iPhoneOS11.2.sdk/System/Library/Frameworks/CoreText.framework/Headers/CoreText.h:20:
/home/1/theos/sdks/iPhoneOS11.2.sdk/System/Library/Frameworks/CoreText.framework/Headers/CTDefines.h:12:10: fatal error: could not build module 'Darwin'
#include <Availability.h>
 ~~~~~~~~^
While building module 'UIKit' imported from ./Menu.h:9:
While building module 'FileProvider' imported from /home/1/theos/sdks/iPhoneOS11.2.sdk/System/Library/Frameworks/UIKit.framework/Headers/NSFileProviderExtension.h:14:
In file included from <module-includes>:1:
In file included from /home/1/theos/sdks/iPhoneOS11.2.sdk/System/Library/Frameworks/FileProvider.framework/Headers/FileProvider.h:8:
/home/1/theos/sdks/iPhoneOS11.2.sdk/System/Library/Frameworks/FileProvider.framework/Headers/NSFileProviderDomain.h:8:9: fatal error: could not build module 'Foundation'
#import <Foundation/Foundation.h>
 ~~~~~~~^
While building module 'MachO' imported from ./KittyMemory/KittyMemory.hpp:16:
In file included from <module-includes>:2:
/home/1/theos/sdks/iPhoneOS11.2.sdk/usr/include/mach-o/arch.h:32:10: fatal error: could not build module 'Darwin'
#include <stdint.h>
 ~~~~~~~~^
While building module 'libkern' imported from ./KittyMemory/KittyMemory.hpp:18:
In file included from <module-includes>:2:
/home/1/theos/sdks/iPhoneOS11.2.sdk/usr/include/libkern/OSCacheControl.h:27:13: fatal error: could not build module 'Darwin'
#include    <stddef.h>
 ~~~~~~~~~~~^
28 errors generated.
make[3]: *** [/home/1/theos/makefiles/instance/rules.mk:205: /home/1/standoff2/.theos/obj/arm64/Menu.mm.f1450fb4.o] Error 1
==> Compiling KittyMemory/writeData.cpp (arm64)…
In file included from KittyMemory/writeData.cpp:13:
KittyMemory/writeData.hpp:17:10: fatal error: could not acquire lock file for module 'Darwin': failed to create link /tmp/org.llvm.clang.197609/ModuleCache/3OMG5BF0COMRL/Darwin-3ETN8VFHP0WSE.pcm.lock to /tmp/org.llvm.clang.197609/ModuleCache/3OMG5BF0COMRL/Darwin-3ETN8VFHP0WSE.pcm.lock-c2823bf0: Permission denied
#include <math.h>
         ^
While building module 'MachO' imported from KittyMemory/KittyMemory.hpp:16:
While building module 'Darwin' imported from /home/1/theos/sdks/iPhoneOS11.2.sdk/usr/include/mach-o/arch.h:32:
In file included from <module-includes>:215:
/home/1/theos/sdks/iPhoneOS11.2.sdk/usr/include/pthread.h:1:1: error: unknown type name 'pthread'; did you mean 'pthread_t'?
pthread/pthread.h
^
/home/1/theos/sdks/iPhoneOS11.2.sdk/usr/include/sys/_pthread/_pthread_t.h:31:28: note: 'pthread_t' declared here
typedef __darwin_pthread_t pthread_t;
                           ^
While building module 'MachO' imported from KittyMemory/KittyMemory.hpp:16:
While building module 'Darwin' imported from /home/1/theos/sdks/iPhoneOS11.2.sdk/usr/include/mach-o/arch.h:32:
In file included from <module-includes>:215:
/home/1/theos/sdks/iPhoneOS11.2.sdk/usr/include/pthread.h:1:8: error: expected unqualified-id
pthread/pthread.h
       ^
While building module 'MachO' imported from KittyMemory/KittyMemory.hpp:16:
While building module 'Darwin' imported from /home/1/theos/sdks/iPhoneOS11.2.sdk/usr/include/mach-o/arch.h:32:
In file included from <module-includes>:218:
/home/1/theos/sdks/iPhoneOS11.2.sdk/usr/include/pthread_impl.h:1:1: error: unknown type name 'pthread'; did you mean 'pthread_t'?
pthread/pthread_impl.h
^
/home/1/theos/sdks/iPhoneOS11.2.sdk/usr/include/sys/_pthread/_pthread_t.h:31:28: note: 'pthread_t' declared here
typedef __darwin_pthread_t pthread_t;
                           ^
While building module 'MachO' imported from KittyMemory/KittyMemory.hpp:16:
While building module 'Darwin' imported from /home/1/theos/sdks/iPhoneOS11.2.sdk/usr/include/mach-o/arch.h:32:
In file included from <module-includes>:218:
/home/1/theos/sdks/iPhoneOS11.2.sdk/usr/include/pthread_impl.h:1:8: error: expected unqualified-id
pthread/pthread_impl.h
       ^
While building module 'MachO' imported from KittyMemory/KittyMemory.hpp:16:
While building module 'Darwin' imported from /home/1/theos/sdks/iPhoneOS11.2.sdk/usr/include/mach-o/arch.h:32:
In file included from <module-includes>:224:
/home/1/theos/sdks/iPhoneOS11.2.sdk/usr/include/pthread_spis.h:1:1: error: unknown type name 'pthread'; did you mean 'pthread_t'?
pthread/pthread_spis.h
^
/home/1/theos/sdks/iPhoneOS11.2.sdk/usr/include/sys/_pthread/_pthread_t.h:31:28: note: 'pthread_t' declared here
typedef __darwin_pthread_t pthread_t;
                           ^
While building module 'MachO' imported from KittyMemory/KittyMemory.hpp:16:
While building module 'Darwin' imported from /home/1/theos/sdks/iPhoneOS11.2.sdk/usr/include/mach-o/arch.h:32:
In file included from <module-includes>:224:
/home/1/theos/sdks/iPhoneOS11.2.sdk/usr/include/pthread_spis.h:1:8: error: expected unqualified-id
pthread/pthread_spis.h
       ^
While building module 'MachO' imported from KittyMemory/KittyMemory.hpp:16:
While building module 'Darwin' imported from /home/1/theos/sdks/iPhoneOS11.2.sdk/usr/include/mach-o/arch.h:32:
In file included from <module-includes>:227:
In file included from /home/1/theos/sdks/iPhoneOS11.2.sdk/usr/include/pthread/spawn.h:32:
In file included from /home/1/theos/sdks/iPhoneOS11.2.sdk/usr/include/pthread/pthread.h:59:
In file included from /home/1/theos/sdks/iPhoneOS11.2.sdk/usr/include/pthread/sched.h:28:
/home/1/theos/sdks/iPhoneOS11.2.sdk/usr/include/pthread_impl.h:1:1: error: unknown type name 'pthread'; did you mean 'pthread_t'?
pthread/pthread_impl.h
^
/home/1/theos/sdks/iPhoneOS11.2.sdk/usr/include/sys/_pthread/_pthread_t.h:31:28: note: 'pthread_t' declared here
typedef __darwin_pthread_t pthread_t;
                           ^
While building module 'MachO' imported from KittyMemory/KittyMemory.hpp:16:
While building module 'Darwin' imported from /home/1/theos/sdks/iPhoneOS11.2.sdk/usr/include/mach-o/arch.h:32:
In file included from <module-includes>:227:
In file included from /home/1/theos/sdks/iPhoneOS11.2.sdk/usr/include/pthread/spawn.h:32:
In file included from /home/1/theos/sdks/iPhoneOS11.2.sdk/usr/include/pthread/pthread.h:59:
In file included from /home/1/theos/sdks/iPhoneOS11.2.sdk/usr/include/pthread/sched.h:28:
/home/1/theos/sdks/iPhoneOS11.2.sdk/usr/include/pthread_impl.h:1:8: error: expected unqualified-id
pthread/pthread_impl.h
       ^
While building module 'MachO' imported from KittyMemory/KittyMemory.hpp:16:
While building module 'Darwin' imported from /home/1/theos/sdks/iPhoneOS11.2.sdk/usr/include/mach-o/arch.h:32:
In file included from <module-includes>:236:
/home/1/theos/sdks/iPhoneOS11.2.sdk/usr/include/sched.h:1:1: error: unknown type name 'pthread'; did you mean 'pthread_t'?
pthread/sched.h
^
/home/1/theos/sdks/iPhoneOS11.2.sdk/usr/include/sys/_pthread/_pthread_t.h:31:28: note: 'pthread_t' declared here
typedef __darwin_pthread_t pthread_t;
                           ^
While building module 'MachO' imported from KittyMemory/KittyMemory.hpp:16:
While building module 'Darwin' imported from /home/1/theos/sdks/iPhoneOS11.2.sdk/usr/include/mach-o/arch.h:32:
In file included from <module-includes>:236:
/home/1/theos/sdks/iPhoneOS11.2.sdk/usr/include/sched.h:1:8: error: expected unqualified-id
pthread/sched.h
       ^
While building module 'MachO' imported from KittyMemory/KittyMemory.hpp:16:
In file included from <module-includes>:2:
/home/1/theos/sdks/iPhoneOS11.2.sdk/usr/include/mach-o/arch.h:32:10: fatal error: could not build module 'Darwin'
#include <stdint.h>
 ~~~~~~~~^
While building module 'libkern' imported from KittyMemory/KittyMemory.hpp:18:
In file included from <module-includes>:2:
/home/1/theos/sdks/iPhoneOS11.2.sdk/usr/include/libkern/OSCacheControl.h:27:13: fatal error: could not build module 'Darwin'
#include    <stddef.h>
 ~~~~~~~~~~~^
13 errors generated.
make[3]: *** [/home/1/theos/makefiles/instance/rules.mk:241: /home/1/standoff2/.theos/obj/arm64/KittyMemory/writeData.cpp.f1450fb4.o] Error 1
==> Compiling SCLAlertView/SCLAlertView.m (arm64)…
While building module 'Darwin' imported from /home/1/theos/Prefix.pch:24:
In file included from <module-includes>:72:
/home/1/theos/sdks/iPhoneOS11.2.sdk/usr/include/pthread.h:1:1: error: unknown type name 'pthread'; did you mean 'pthread_t'?
pthread/pthread.h
^
/home/1/theos/sdks/iPhoneOS11.2.sdk/usr/include/sys/_pthread/_pthread_t.h:31:28: note: 'pthread_t' declared here
typedef __darwin_pthread_t pthread_t;
                           ^
While building module 'Darwin' imported from /home/1/theos/Prefix.pch:24:
In file included from <module-includes>:72:
/home/1/theos/sdks/iPhoneOS11.2.sdk/usr/include/pthread.h:1:8: error: expected identifier or '('
pthread/pthread.h
       ^
While building module 'Darwin' imported from /home/1/theos/Prefix.pch:24:
In file included from <module-includes>:73:
/home/1/theos/sdks/iPhoneOS11.2.sdk/usr/include/pthread_impl.h:1:1: error: unknown type name 'pthread'; did you mean 'pthread_t'?
pthread/pthread_impl.h
^
/home/1/theos/sdks/iPhoneOS11.2.sdk/usr/include/sys/_pthread/_pthread_t.h:31:28: note: 'pthread_t' declared here
typedef __darwin_pthread_t pthread_t;
                           ^
While building module 'Darwin' imported from /home/1/theos/Prefix.pch:24:
In file included from <module-includes>:73:
/home/1/theos/sdks/iPhoneOS11.2.sdk/usr/include/pthread_impl.h:1:8: error: expected identifier or '('
pthread/pthread_impl.h
       ^
While building module 'Darwin' imported from /home/1/theos/Prefix.pch:24:
In file included from <module-includes>:75:
/home/1/theos/sdks/iPhoneOS11.2.sdk/usr/include/pthread_spis.h:1:1: error: unknown type name 'pthread'; did you mean 'pthread_t'?
pthread/pthread_spis.h
^
/home/1/theos/sdks/iPhoneOS11.2.sdk/usr/include/sys/_pthread/_pthread_t.h:31:28: note: 'pthread_t' declared here
typedef __darwin_pthread_t pthread_t;
                           ^
While building module 'Darwin' imported from /home/1/theos/Prefix.pch:24:
In file included from <module-includes>:75:
/home/1/theos/sdks/iPhoneOS11.2.sdk/usr/include/pthread_spis.h:1:8: error: expected identifier or '('
pthread/pthread_spis.h
       ^
While building module 'Darwin' imported from /home/1/theos/Prefix.pch:24:
In file included from <module-includes>:79:
/home/1/theos/sdks/iPhoneOS11.2.sdk/usr/include/sched.h:1:1: error: unknown type name 'pthread'; did you mean 'pthread_t'?
pthread/sched.h
^
/home/1/theos/sdks/iPhoneOS11.2.sdk/usr/include/sys/_pthread/_pthread_t.h:31:28: note: 'pthread_t' declared here
typedef __darwin_pthread_t pthread_t;
                           ^
While building module 'Darwin' imported from /home/1/theos/Prefix.pch:24:
In file included from <module-includes>:79:
/home/1/theos/sdks/iPhoneOS11.2.sdk/usr/include/sched.h:1:8: error: expected identifier or '('
pthread/sched.h
       ^
In file included from <built-in>:1:
/home/1/theos/Prefix.pch:24:12: fatal error: could not build module 'Darwin'
                        #import <TargetConditionals.h>
                         ~~~~~~~^
While building module 'UIKit' imported from SCLAlertView/SCLAlertView.h:10:
In file included from <module-includes>:1:
In file included from /home/1/theos/sdks/iPhoneOS11.2.sdk/System/Library/Frameworks/UIKit.framework/Headers/UIKit.h:8:
/home/1/theos/sdks/iPhoneOS11.2.sdk/System/Library/Frameworks/UIKit.framework/Headers/UIKitDefines.h:8:9: fatal error: could not build module 'Darwin'
#import <Availability.h>
 ~~~~~~~^
While building module 'UIKit' imported from SCLAlertView/SCLAlertView.h:10:
While building module 'Foundation' imported from /home/1/theos/sdks/iPhoneOS11.2.sdk/System/Library/Frameworks/UIKit.framework/Headers/UIAccelerometer.h:8:
While building module 'CoreFoundation' imported from /home/1/theos/sdks/iPhoneOS11.2.sdk/System/Library/Frameworks/Foundation.framework/Headers/Foundation.h:6:
In file included from <module-includes>:1:
/home/1/theos/sdks/iPhoneOS11.2.sdk/System/Library/Frameworks/CoreFoundation.framework/Headers/CoreFoundation.h:16:10: fatal error: could not build module 'Darwin'
#include <sys/types.h>
 ~~~~~~~~^
While building module 'UIKit' imported from SCLAlertView/SCLAlertView.h:10:
While building module 'Foundation' imported from /home/1/theos/sdks/iPhoneOS11.2.sdk/System/Library/Frameworks/UIKit.framework/Headers/UIAccelerometer.h:8:
While building module 'CoreFoundation' imported from /home/1/theos/sdks/iPhoneOS11.2.sdk/System/Library/Frameworks/Foundation.framework/Headers/Foundation.h:6:
While building module 'Dispatch' imported from /home/1/theos/sdks/iPhoneOS11.2.sdk/System/Library/Frameworks/CoreFoundation.framework/Headers/CFStream.h:20:
In file included from <module-includes>:1:
/home/1/theos/sdks/iPhoneOS11.2.sdk/usr/include/dispatch/dispatch.h:25:10: fatal error: could not build module 'Darwin'
#include <Availability.h>
 ~~~~~~~~^
While building module 'UIKit' imported from SCLAlertView/SCLAlertView.h:10:
While building module 'Foundation' imported from /home/1/theos/sdks/iPhoneOS11.2.sdk/System/Library/Frameworks/UIKit.framework/Headers/UIAccelerometer.h:8:
While building module 'CoreFoundation' imported from /home/1/theos/sdks/iPhoneOS11.2.sdk/System/Library/Frameworks/Foundation.framework/Headers/Foundation.h:6:
While building module 'Dispatch' imported from /home/1/theos/sdks/iPhoneOS11.2.sdk/System/Library/Frameworks/CoreFoundation.framework/Headers/CFStream.h:20:
While building module 'os_object' imported from /home/1/theos/sdks/iPhoneOS11.2.sdk/usr/include/dispatch/dispatch.h:59:
In file included from <module-includes>:1:
/home/1/theos/sdks/iPhoneOS11.2.sdk/usr/include/os/object.h:25:10: fatal error: could not build module 'Darwin'
#include <Availability.h>
 ~~~~~~~~^
While building module 'UIKit' imported from SCLAlertView/SCLAlertView.h:10:
While building module 'Foundation' imported from /home/1/theos/sdks/iPhoneOS11.2.sdk/System/Library/Frameworks/UIKit.framework/Headers/UIAccelerometer.h:8:
In file included from <module-includes>:1:
/home/1/theos/sdks/iPhoneOS11.2.sdk/System/Library/Frameworks/Foundation.framework/Headers/Foundation.h:6:10: fatal error: could not build module 'CoreFoundation'
#include <CoreFoundation/CoreFoundation.h>
 ~~~~~~~~^
While building module 'UIKit' imported from SCLAlertView/SCLAlertView.h:10:
While building module 'Foundation' imported from /home/1/theos/sdks/iPhoneOS11.2.sdk/System/Library/Frameworks/UIKit.framework/Headers/UIAccelerometer.h:8:
While building module 'ObjectiveC' imported from /home/1/theos/sdks/iPhoneOS11.2.sdk/System/Library/Frameworks/Foundation.framework/Headers/NSObject.h:6:
In file included from <module-includes>:1:
In file included from /home/1/theos/sdks/iPhoneOS11.2.sdk/usr/include/objc/./message.h:27:
/home/1/theos/sdks/iPhoneOS11.2.sdk/usr/include/objc/objc.h:31:10: fatal error: could not build module 'Darwin'
#include <sys/types.h>      // for __DARWIN_NULL
 ~~~~~~~~^
While building module 'UIKit' imported from SCLAlertView/SCLAlertView.h:10:
While building module 'Foundation' imported from /home/1/theos/sdks/iPhoneOS11.2.sdk/System/Library/Frameworks/UIKit.framework/Headers/UIAccelerometer.h:8:
While building module 'Security' imported from /home/1/theos/sdks/iPhoneOS11.2.sdk/System/Library/Frameworks/Foundation.framework/Headers/NSURLCredential.h:9:
In file included from <module-includes>:1:
In file included from /home/1/theos/sdks/iPhoneOS11.2.sdk/System/Library/Frameworks/Security.framework/Headers/Security.h:27:
/home/1/theos/sdks/iPhoneOS11.2.sdk/System/Library/Frameworks/Security.framework/Headers/SecBase.h:27:10: fatal error: could not build module 'Darwin'
#include <TargetConditionals.h>
 ~~~~~~~~^
While building module 'UIKit' imported from SCLAlertView/SCLAlertView.h:10:
While building module 'CoreGraphics' imported from /home/1/theos/sdks/iPhoneOS11.2.sdk/System/Library/Frameworks/UIKit.framework/Headers/UIAccessibility.h:9:
In file included from <module-includes>:1:
In file included from /home/1/theos/sdks/iPhoneOS11.2.sdk/System/Library/Frameworks/CoreGraphics.framework/Headers/CoreGraphics.h:8:
/home/1/theos/sdks/iPhoneOS11.2.sdk/System/Library/Frameworks/CoreGraphics.framework/Headers/CGBase.h:8:10: fatal error: could not build module 'Darwin'
#include <stdbool.h>
 ~~~~~~~~^
While building module 'UIKit' imported from SCLAlertView/SCLAlertView.h:10:
While building module 'QuartzCore' imported from /home/1/theos/sdks/iPhoneOS11.2.sdk/System/Library/Frameworks/UIKit.framework/Headers/UIView.h:9:
In file included from <module-includes>:1:
In file included from /home/1/theos/sdks/iPhoneOS11.2.sdk/System/Library/Frameworks/QuartzCore.framework/Headers/QuartzCore.h:9:
In file included from /home/1/theos/sdks/iPhoneOS11.2.sdk/System/Library/Frameworks/QuartzCore.framework/Headers/CoreAnimation.h:9:
/home/1/theos/sdks/iPhoneOS11.2.sdk/System/Library/Frameworks/QuartzCore.framework/Headers/CABase.h:11:10: fatal error: could not build module 'Darwin'
#include <stdbool.h>
 ~~~~~~~~^
While building module 'UIKit' imported from SCLAlertView/SCLAlertView.h:10:
While building module 'QuartzCore' imported from /home/1/theos/sdks/iPhoneOS11.2.sdk/System/Library/Frameworks/UIKit.framework/Headers/UIView.h:9:
While building module 'OpenGLES' imported from /home/1/theos/sdks/iPhoneOS11.2.sdk/System/Library/Frameworks/QuartzCore.framework/Headers/CAEAGLLayer.h:7:
In file included from <module-includes>:1:
/home/1/theos/sdks/iPhoneOS11.2.sdk/System/Library/Frameworks/OpenGLES.framework/Headers/EAGL.h:8:10: fatal error: could not build module 'Foundation'
#include <Foundation/Foundation.h>
 ~~~~~~~~^
While building module 'UIKit' imported from SCLAlertView/SCLAlertView.h:10:
While building module 'QuartzCore' imported from /home/1/theos/sdks/iPhoneOS11.2.sdk/System/Library/Frameworks/UIKit.framework/Headers/UIView.h:9:
While building module 'Metal' imported from /home/1/theos/sdks/iPhoneOS11.2.sdk/System/Library/Frameworks/QuartzCore.framework/Headers/CAMetalLayer.h:7:
In file included from <module-includes>:1:
In file included from /home/1/theos/sdks/iPhoneOS11.2.sdk/System/Library/Frameworks/Metal.framework/Headers/Metal.h:8:
/home/1/theos/sdks/iPhoneOS11.2.sdk/System/Library/Frameworks/Metal.framework/Headers/MTLDefines.h:8:9: fatal error: could not build module 'Darwin'
#import <Availability.h>
 ~~~~~~~^
While building module 'UIKit' imported from SCLAlertView/SCLAlertView.h:10:
While building module 'QuartzCore' imported from /home/1/theos/sdks/iPhoneOS11.2.sdk/System/Library/Frameworks/UIKit.framework/Headers/UIView.h:9:
While building module 'Metal' imported from /home/1/theos/sdks/iPhoneOS11.2.sdk/System/Library/Frameworks/QuartzCore.framework/Headers/CAMetalLayer.h:7:
While building module 'IOSurface' imported from /home/1/theos/sdks/iPhoneOS11.2.sdk/System/Library/Frameworks/Metal.framework/Headers/MTLTexture.h:15:
In file included from <module-includes>:1:
/home/1/theos/sdks/iPhoneOS11.2.sdk/System/Library/Frameworks/IOSurface.framework/Headers/IOSurfaceBase.h:12:10: fatal error: could not build module 'Darwin'
#include <sys/cdefs.h>
 ~~~~~~~~^
While building module 'UIKit' imported from SCLAlertView/SCLAlertView.h:10:
While building module 'CoreImage' imported from /home/1/theos/sdks/iPhoneOS11.2.sdk/System/Library/Frameworks/UIKit.framework/Headers/UIColor.h:11:
In file included from <module-includes>:1:
In file included from /home/1/theos/sdks/iPhoneOS11.2.sdk/System/Library/Frameworks/CoreImage.framework/Headers/CoreImage.h:8:
/home/1/theos/sdks/iPhoneOS11.2.sdk/System/Library/Frameworks/CoreImage.framework/Headers/CoreImageDefines.h:10:10: fatal error: could not build module 'Darwin'
#include <TargetConditionals.h>
 ~~~~~~~~^
While building module 'UIKit' imported from SCLAlertView/SCLAlertView.h:10:
While building module 'CoreImage' imported from /home/1/theos/sdks/iPhoneOS11.2.sdk/System/Library/Frameworks/UIKit.framework/Headers/UIColor.h:11:
While building module 'CoreVideo' imported from /home/1/theos/sdks/iPhoneOS11.2.sdk/System/Library/Frameworks/CoreImage.framework/Headers/CIImage.h:10:
In file included from <module-includes>:1:
/home/1/theos/sdks/iPhoneOS11.2.sdk/System/Library/Frameworks/CoreVideo.framework/Headers/CoreVideo.h:16:10: fatal error: could not build module 'Darwin'
#include <TargetConditionals.h>
 ~~~~~~~~^
While building module 'UIKit' imported from SCLAlertView/SCLAlertView.h:10:
While building module 'CoreImage' imported from /home/1/theos/sdks/iPhoneOS11.2.sdk/System/Library/Frameworks/UIKit.framework/Headers/UIColor.h:11:
While building module 'ImageIO' imported from /home/1/theos/sdks/iPhoneOS11.2.sdk/System/Library/Frameworks/CoreImage.framework/Headers/CIImage.h:11:
In file included from <module-includes>:1:
In file included from /home/1/theos/sdks/iPhoneOS11.2.sdk/System/Library/Frameworks/ImageIO.framework/Headers/ImageIO.h:10:
/home/1/theos/sdks/iPhoneOS11.2.sdk/System/Library/Frameworks/ImageIO.framework/Headers/ImageIOBase.h:11:10: fatal error: could not build module 'CoreFoundation'
#include <CoreFoundation/CoreFoundation.h>
 ~~~~~~~~^
While building module 'UIKit' imported from SCLAlertView/SCLAlertView.h:10:
While building module 'CoreText' imported from /home/1/theos/sdks/iPhoneOS11.2.sdk/System/Library/Frameworks/UIKit.framework/Headers/NSText.h:10:
In file included from <module-includes>:1:
In file included from /home/1/theos/sdks/iPhoneOS11.2.sdk/System/Library/Frameworks/CoreText.framework/Headers/CoreText.h:20:
/home/1/theos/sdks/iPhoneOS11.2.sdk/System/Library/Frameworks/CoreText.framework/Headers/CTDefines.h:12:10: fatal error: could not build module 'Darwin'
#include <Availability.h>
 ~~~~~~~~^
While building module 'UIKit' imported from SCLAlertView/SCLAlertView.h:10:
While building module 'FileProvider' imported from /home/1/theos/sdks/iPhoneOS11.2.sdk/System/Library/Frameworks/UIKit.framework/Headers/NSFileProviderExtension.h:14:
In file included from <module-includes>:1:
In file included from /home/1/theos/sdks/iPhoneOS11.2.sdk/System/Library/Frameworks/FileProvider.framework/Headers/FileProvider.h:8:
/home/1/theos/sdks/iPhoneOS11.2.sdk/System/Library/Frameworks/FileProvider.framework/Headers/NSFileProviderDomain.h:8:9: fatal error: could not build module 'Foundation'
#import <Foundation/Foundation.h>
 ~~~~~~~^
While building module 'AVFoundation' imported from SCLAlertView/SCLAlertView.m:17:
In file included from <module-includes>:1:
/home/1/theos/sdks/iPhoneOS11.2.sdk/System/Library/Frameworks/AVFoundation.framework/Headers/AVFoundation.h:12:9: fatal error: could not build module 'Darwin'
#import <TargetConditionals.h>
 ~~~~~~~^
While building module 'AVFoundation' imported from SCLAlertView/SCLAlertView.m:17:
While building module 'CoreMedia' imported from /home/1/theos/sdks/iPhoneOS11.2.sdk/System/Library/Frameworks/AVFoundation.framework/Headers/AVAsset.h:19:
In file included from <module-includes>:1:
In file included from /home/1/theos/sdks/iPhoneOS11.2.sdk/System/Library/Frameworks/CoreMedia.framework/Headers/CoreMedia.h:12:
/home/1/theos/sdks/iPhoneOS11.2.sdk/System/Library/Frameworks/CoreMedia.framework/Headers/CMBase.h:13:10: fatal error: could not build module 'Darwin'
#include <TargetConditionals.h>
 ~~~~~~~~^
While building module 'AVFoundation' imported from SCLAlertView/SCLAlertView.m:17:
While building module 'CoreMedia' imported from /home/1/theos/sdks/iPhoneOS11.2.sdk/System/Library/Frameworks/AVFoundation.framework/Headers/AVAsset.h:19:
While building module 'CoreAudio' imported from /home/1/theos/sdks/iPhoneOS11.2.sdk/System/Library/Frameworks/CoreMedia.framework/Headers/CMFormatDescription.h:26:
In file included from <module-includes>:1:
/home/1/theos/sdks/iPhoneOS11.2.sdk/System/Library/Frameworks/CoreAudio.framework/Headers/CoreAudioTypes.h:28:10: fatal error: could not build module 'Darwin'
#include <TargetConditionals.h>
 ~~~~~~~~^
While building module 'AVFoundation' imported from SCLAlertView/SCLAlertView.m:17:
While building module 'CoreMedia' imported from /home/1/theos/sdks/iPhoneOS11.2.sdk/System/Library/Frameworks/AVFoundation.framework/Headers/AVAsset.h:19:
While building module 'AudioToolbox' imported from /home/1/theos/sdks/iPhoneOS11.2.sdk/System/Library/Frameworks/CoreMedia.framework/Headers/CMFormatDescription.h:27:
In file included from <module-includes>:1:
/home/1/theos/sdks/iPhoneOS11.2.sdk/System/Library/Frameworks/AudioToolbox.framework/Headers/AudioToolbox.h:14:10: fatal error: could not build module 'Darwin'
#include <Availability.h>
 ~~~~~~~~^
While building module 'AVFoundation' imported from SCLAlertView/SCLAlertView.m:17:
While building module 'CoreMedia' imported from /home/1/theos/sdks/iPhoneOS11.2.sdk/System/Library/Frameworks/AVFoundation.framework/Headers/AVAsset.h:19:
While building module 'AudioToolbox' imported from /home/1/theos/sdks/iPhoneOS11.2.sdk/System/Library/Frameworks/CoreMedia.framework/Headers/CMFormatDescription.h:27:
While building module 'CoreMIDI' imported from /home/1/theos/sdks/iPhoneOS11.2.sdk/System/Library/Frameworks/AudioToolbox.framework/Headers/MusicPlayer.h:44:
In file included from <module-includes>:1:
In file included from /home/1/theos/sdks/iPhoneOS11.2.sdk/System/Library/Frameworks/CoreMIDI.framework/Headers/CoreMIDI.h:18:
/home/1/theos/sdks/iPhoneOS11.2.sdk/System/Library/Frameworks/CoreMIDI.framework/Headers/MIDIServices.h:68:10: fatal error: could not build module 'Darwin'
#include <Availability.h>
 ~~~~~~~~^
While building module 'AVFoundation' imported from SCLAlertView/SCLAlertView.m:17:
While building module 'MediaToolbox' imported from /home/1/theos/sdks/iPhoneOS11.2.sdk/System/Library/Frameworks/AVFoundation.framework/Headers/AVAudioMix.h:16:
In file included from <module-includes>:1:
In file included from /home/1/theos/sdks/iPhoneOS11.2.sdk/System/Library/Frameworks/MediaToolbox.framework/Headers/MediaToolbox.h:11:
/home/1/theos/sdks/iPhoneOS11.2.sdk/System/Library/Frameworks/MediaToolbox.framework/Headers/MTAudioProcessingTap.h:12:10: fatal error: could not build module 'CoreFoundation'
#include <CoreFoundation/CoreFoundation.h>
 ~~~~~~~~^
While building module 'AVFoundation' imported from SCLAlertView/SCLAlertView.m:17:
While building module 'simd' imported from /home/1/theos/sdks/iPhoneOS11.2.sdk/System/Library/Frameworks/AVFoundation.framework/Headers/AVCameraCalibrationData.h:11:
In file included from <module-includes>:1:
In file included from /home/1/theos/sdks/iPhoneOS11.2.sdk/usr/include/simd/simd.h:17:
In file included from /home/1/theos/sdks/iPhoneOS11.2.sdk/usr/include/simd/vector.h:43:
In file included from /home/1/theos/sdks/iPhoneOS11.2.sdk/usr/include/simd/vector_types.h:89:
/home/1/theos/sdks/iPhoneOS11.2.sdk/usr/include/simd/base.h:36:13: fatal error: could not build module 'Darwin'
#   include <Availability.h>
    ~~~~~~~~^
While building module 'AVFoundation' imported from SCLAlertView/SCLAlertView.m:17:
While building module 'simd' imported from /home/1/theos/sdks/iPhoneOS11.2.sdk/System/Library/Frameworks/AVFoundation.framework/Headers/AVCameraCalibrationData.h:11:
While building module '_Builtin_intrinsics' imported from /home/1/theos/sdks/iPhoneOS11.2.sdk/usr/include/simd/base.h:73:
In file included from <module-includes>:1:
/home/1/theos/toolchain/windows/iphone/bin/../lib/clang/3.9.1/include/arm_acle.h:31:10: fatal error: could not build module 'Darwin'
#include <stdint.h>
 ~~~~~~~~^
34 errors generated.
make[3]: *** [/home/1/theos/makefiles/instance/rules.mk:197: /home/1/standoff2/.theos/obj/arm64/SCLAlertView/SCLAlertView.m.f1450fb4.o] Error 1
==> Compiling SCLAlertView/SCLAlertViewResponder.m (arm64)…
While building module 'Darwin' imported from /home/1/theos/Prefix.pch:24:
In file included from <module-includes>:72:
/home/1/theos/sdks/iPhoneOS11.2.sdk/usr/include/pthread.h:1:1: error: unknown type name 'pthread'; did you mean 'pthread_t'?
pthread/pthread.h
^
/home/1/theos/sdks/iPhoneOS11.2.sdk/usr/include/sys/_pthread/_pthread_t.h:31:28: note: 'pthread_t' declared here
typedef __darwin_pthread_t pthread_t;
                           ^
While building module 'Darwin' imported from /home/1/theos/Prefix.pch:24:
In file included from <module-includes>:72:
/home/1/theos/sdks/iPhoneOS11.2.sdk/usr/include/pthread.h:1:8: error: expected identifier or '('
pthread/pthread.h
       ^
While building module 'Darwin' imported from /home/1/theos/Prefix.pch:24:
In file included from <module-includes>:73:
/home/1/theos/sdks/iPhoneOS11.2.sdk/usr/include/pthread_impl.h:1:1: error: unknown type name 'pthread'; did you mean 'pthread_t'?
pthread/pthread_impl.h
^
/home/1/theos/sdks/iPhoneOS11.2.sdk/usr/include/sys/_pthread/_pthread_t.h:31:28: note: 'pthread_t' declared here
typedef __darwin_pthread_t pthread_t;
                           ^
While building module 'Darwin' imported from /home/1/theos/Prefix.pch:24:
In file included from <module-includes>:73:
/home/1/theos/sdks/iPhoneOS11.2.sdk/usr/include/pthread_impl.h:1:8: error: expected identifier or '('
pthread/pthread_impl.h
       ^
While building module 'Darwin' imported from /home/1/theos/Prefix.pch:24:
In file included from <module-includes>:75:
/home/1/theos/sdks/iPhoneOS11.2.sdk/usr/include/pthread_spis.h:1:1: error: unknown type name 'pthread'; did you mean 'pthread_t'?
pthread/pthread_spis.h
^
/home/1/theos/sdks/iPhoneOS11.2.sdk/usr/include/sys/_pthread/_pthread_t.h:31:28: note: 'pthread_t' declared here
typedef __darwin_pthread_t pthread_t;
                           ^
While building module 'Darwin' imported from /home/1/theos/Prefix.pch:24:
In file included from <module-includes>:75:
/home/1/theos/sdks/iPhoneOS11.2.sdk/usr/include/pthread_spis.h:1:8: error: expected identifier or '('
pthread/pthread_spis.h
       ^
While building module 'Darwin' imported from /home/1/theos/Prefix.pch:24:
In file included from <module-includes>:79:
/home/1/theos/sdks/iPhoneOS11.2.sdk/usr/include/sched.h:1:1: error: unknown type name 'pthread'; did you mean 'pthread_t'?
pthread/sched.h
^
/home/1/theos/sdks/iPhoneOS11.2.sdk/usr/include/sys/_pthread/_pthread_t.h:31:28: note: 'pthread_t' declared here
typedef __darwin_pthread_t pthread_t;
                           ^
While building module 'Darwin' imported from /home/1/theos/Prefix.pch:24:
In file included from <module-includes>:79:
/home/1/theos/sdks/iPhoneOS11.2.sdk/usr/include/sched.h:1:8: error: expected identifier or '('
pthread/sched.h
       ^
In file included from <built-in>:1:
/home/1/theos/Prefix.pch:24:12: fatal error: could not build module 'Darwin'
                        #import <TargetConditionals.h>
                         ~~~~~~~^
While building module 'Foundation' imported from SCLAlertView/SCLAlertViewResponder.h:10:
While building module 'CoreFoundation' imported from /home/1/theos/sdks/iPhoneOS11.2.sdk/System/Library/Frameworks/Foundation.framework/Headers/Foundation.h:6:
In file included from <module-includes>:1:
/home/1/theos/sdks/iPhoneOS11.2.sdk/System/Library/Frameworks/CoreFoundation.framework/Headers/CoreFoundation.h:16:10: fatal error: could not build module 'Darwin'
#include <sys/types.h>
 ~~~~~~~~^
While building module 'Foundation' imported from SCLAlertView/SCLAlertViewResponder.h:10:
While building module 'CoreFoundation' imported from /home/1/theos/sdks/iPhoneOS11.2.sdk/System/Library/Frameworks/Foundation.framework/Headers/Foundation.h:6:
While building module 'Dispatch' imported from /home/1/theos/sdks/iPhoneOS11.2.sdk/System/Library/Frameworks/CoreFoundation.framework/Headers/CFStream.h:20:
In file included from <module-includes>:1:
/home/1/theos/sdks/iPhoneOS11.2.sdk/usr/include/dispatch/dispatch.h:25:10: fatal error: could not build module 'Darwin'
#include <Availability.h>
 ~~~~~~~~^
While building module 'Foundation' imported from SCLAlertView/SCLAlertViewResponder.h:10:
While building module 'CoreFoundation' imported from /home/1/theos/sdks/iPhoneOS11.2.sdk/System/Library/Frameworks/Foundation.framework/Headers/Foundation.h:6:
While building module 'Dispatch' imported from /home/1/theos/sdks/iPhoneOS11.2.sdk/System/Library/Frameworks/CoreFoundation.framework/Headers/CFStream.h:20:
While building module 'os_object' imported from /home/1/theos/sdks/iPhoneOS11.2.sdk/usr/include/dispatch/dispatch.h:59:
In file included from <module-includes>:1:
/home/1/theos/sdks/iPhoneOS11.2.sdk/usr/include/os/object.h:25:10: fatal error: could not build module 'Darwin'
#include <Availability.h>
 ~~~~~~~~^
While building module 'Foundation' imported from SCLAlertView/SCLAlertViewResponder.h:10:
In file included from <module-includes>:1:
/home/1/theos/sdks/iPhoneOS11.2.sdk/System/Library/Frameworks/Foundation.framework/Headers/Foundation.h:6:10: fatal error: could not build module 'CoreFoundation'
#include <CoreFoundation/CoreFoundation.h>
 ~~~~~~~~^
While building module 'Foundation' imported from SCLAlertView/SCLAlertViewResponder.h:10:
While building module 'ObjectiveC' imported from /home/1/theos/sdks/iPhoneOS11.2.sdk/System/Library/Frameworks/Foundation.framework/Headers/NSObject.h:6:
In file included from <module-includes>:1:
In file included from /home/1/theos/sdks/iPhoneOS11.2.sdk/usr/include/objc/./message.h:27:
/home/1/theos/sdks/iPhoneOS11.2.sdk/usr/include/objc/objc.h:31:10: fatal error: could not build module 'Darwin'
#include <sys/types.h>      // for __DARWIN_NULL
 ~~~~~~~~^
While building module 'Foundation' imported from SCLAlertView/SCLAlertViewResponder.h:10:
While building module 'Security' imported from /home/1/theos/sdks/iPhoneOS11.2.sdk/System/Library/Frameworks/Foundation.framework/Headers/NSURLCredential.h:9:
In file included from <module-includes>:1:
In file included from /home/1/theos/sdks/iPhoneOS11.2.sdk/System/Library/Frameworks/Security.framework/Headers/Security.h:27:
/home/1/theos/sdks/iPhoneOS11.2.sdk/System/Library/Frameworks/Security.framework/Headers/SecBase.h:27:10: fatal error: could not build module 'Darwin'
#include <TargetConditionals.h>
 ~~~~~~~~^
While building module 'UIKit' imported from SCLAlertView/SCLAlertView.h:10:
In file included from <module-includes>:1:
In file included from /home/1/theos/sdks/iPhoneOS11.2.sdk/System/Library/Frameworks/UIKit.framework/Headers/UIKit.h:8:
/home/1/theos/sdks/iPhoneOS11.2.sdk/System/Library/Frameworks/UIKit.framework/Headers/UIKitDefines.h:8:9: fatal error: could not build module 'Darwin'
#import <Availability.h>
 ~~~~~~~^
While building module 'UIKit' imported from SCLAlertView/SCLAlertView.h:10:
While building module 'CoreGraphics' imported from /home/1/theos/sdks/iPhoneOS11.2.sdk/System/Library/Frameworks/UIKit.framework/Headers/UIAccessibility.h:9:
In file included from <module-includes>:1:
In file included from /home/1/theos/sdks/iPhoneOS11.2.sdk/System/Library/Frameworks/CoreGraphics.framework/Headers/CoreGraphics.h:8:
/home/1/theos/sdks/iPhoneOS11.2.sdk/System/Library/Frameworks/CoreGraphics.framework/Headers/CGBase.h:8:10: fatal error: could not build module 'Darwin'
#include <stdbool.h>
 ~~~~~~~~^
While building module 'UIKit' imported from SCLAlertView/SCLAlertView.h:10:
While building module 'QuartzCore' imported from /home/1/theos/sdks/iPhoneOS11.2.sdk/System/Library/Frameworks/UIKit.framework/Headers/UIView.h:9:
In file included from <module-includes>:1:
In file included from /home/1/theos/sdks/iPhoneOS11.2.sdk/System/Library/Frameworks/QuartzCore.framework/Headers/QuartzCore.h:9:
In file included from /home/1/theos/sdks/iPhoneOS11.2.sdk/System/Library/Frameworks/QuartzCore.framework/Headers/CoreAnimation.h:9:
/home/1/theos/sdks/iPhoneOS11.2.sdk/System/Library/Frameworks/QuartzCore.framework/Headers/CABase.h:11:10: fatal error: could not build module 'Darwin'
#include <stdbool.h>
 ~~~~~~~~^
While building module 'UIKit' imported from SCLAlertView/SCLAlertView.h:10:
While building module 'QuartzCore' imported from /home/1/theos/sdks/iPhoneOS11.2.sdk/System/Library/Frameworks/UIKit.framework/Headers/UIView.h:9:
While building module 'OpenGLES' imported from /home/1/theos/sdks/iPhoneOS11.2.sdk/System/Library/Frameworks/QuartzCore.framework/Headers/CAEAGLLayer.h:7:
In file included from <module-includes>:1:
/home/1/theos/sdks/iPhoneOS11.2.sdk/System/Library/Frameworks/OpenGLES.framework/Headers/EAGL.h:8:10: fatal error: could not build module 'Foundation'
#include <Foundation/Foundation.h>
 ~~~~~~~~^
While building module 'UIKit' imported from SCLAlertView/SCLAlertView.h:10:
While building module 'QuartzCore' imported from /home/1/theos/sdks/iPhoneOS11.2.sdk/System/Library/Frameworks/UIKit.framework/Headers/UIView.h:9:
While building module 'Metal' imported from /home/1/theos/sdks/iPhoneOS11.2.sdk/System/Library/Frameworks/QuartzCore.framework/Headers/CAMetalLayer.h:7:
In file included from <module-includes>:1:
In file included from /home/1/theos/sdks/iPhoneOS11.2.sdk/System/Library/Frameworks/Metal.framework/Headers/Metal.h:8:
/home/1/theos/sdks/iPhoneOS11.2.sdk/System/Library/Frameworks/Metal.framework/Headers/MTLDefines.h:8:9: fatal error: could not build module 'Darwin'
#import <Availability.h>
 ~~~~~~~^
While building module 'UIKit' imported from SCLAlertView/SCLAlertView.h:10:
While building module 'QuartzCore' imported from /home/1/theos/sdks/iPhoneOS11.2.sdk/System/Library/Frameworks/UIKit.framework/Headers/UIView.h:9:
While building module 'Metal' imported from /home/1/theos/sdks/iPhoneOS11.2.sdk/System/Library/Frameworks/QuartzCore.framework/Headers/CAMetalLayer.h:7:
While building module 'IOSurface' imported from /home/1/theos/sdks/iPhoneOS11.2.sdk/System/Library/Frameworks/Metal.framework/Headers/MTLTexture.h:15:
In file included from <module-includes>:1:
/home/1/theos/sdks/iPhoneOS11.2.sdk/System/Library/Frameworks/IOSurface.framework/Headers/IOSurfaceBase.h:12:10: fatal error: could not build module 'Darwin'
#include <sys/cdefs.h>
 ~~~~~~~~^
While building module 'UIKit' imported from SCLAlertView/SCLAlertView.h:10:
While building module 'CoreImage' imported from /home/1/theos/sdks/iPhoneOS11.2.sdk/System/Library/Frameworks/UIKit.framework/Headers/UIColor.h:11:
In file included from <module-includes>:1:
In file included from /home/1/theos/sdks/iPhoneOS11.2.sdk/System/Library/Frameworks/CoreImage.framework/Headers/CoreImage.h:8:
/home/1/theos/sdks/iPhoneOS11.2.sdk/System/Library/Frameworks/CoreImage.framework/Headers/CoreImageDefines.h:10:10: fatal error: could not build module 'Darwin'
#include <TargetConditionals.h>
 ~~~~~~~~^
While building module 'UIKit' imported from SCLAlertView/SCLAlertView.h:10:
While building module 'CoreImage' imported from /home/1/theos/sdks/iPhoneOS11.2.sdk/System/Library/Frameworks/UIKit.framework/Headers/UIColor.h:11:
While building module 'CoreVideo' imported from /home/1/theos/sdks/iPhoneOS11.2.sdk/System/Library/Frameworks/CoreImage.framework/Headers/CIImage.h:10:
In file included from <module-includes>:1:
/home/1/theos/sdks/iPhoneOS11.2.sdk/System/Library/Frameworks/CoreVideo.framework/Headers/CoreVideo.h:16:10: fatal error: could not build module 'Darwin'
#include <TargetConditionals.h>
 ~~~~~~~~^
While building module 'UIKit' imported from SCLAlertView/SCLAlertView.h:10:
While building module 'CoreImage' imported from /home/1/theos/sdks/iPhoneOS11.2.sdk/System/Library/Frameworks/UIKit.framework/Headers/UIColor.h:11:
While building module 'ImageIO' imported from /home/1/theos/sdks/iPhoneOS11.2.sdk/System/Library/Frameworks/CoreImage.framework/Headers/CIImage.h:11:
In file included from <module-includes>:1:
In file included from /home/1/theos/sdks/iPhoneOS11.2.sdk/System/Library/Frameworks/ImageIO.framework/Headers/ImageIO.h:10:
/home/1/theos/sdks/iPhoneOS11.2.sdk/System/Library/Frameworks/ImageIO.framework/Headers/ImageIOBase.h:11:10: fatal error: could not build module 'CoreFoundation'
#include <CoreFoundation/CoreFoundation.h>
 ~~~~~~~~^
While building module 'UIKit' imported from SCLAlertView/SCLAlertView.h:10:
While building module 'CoreText' imported from /home/1/theos/sdks/iPhoneOS11.2.sdk/System/Library/Frameworks/UIKit.framework/Headers/NSText.h:10:
In file included from <module-includes>:1:
In file included from /home/1/theos/sdks/iPhoneOS11.2.sdk/System/Library/Frameworks/CoreText.framework/Headers/CoreText.h:20:
/home/1/theos/sdks/iPhoneOS11.2.sdk/System/Library/Frameworks/CoreText.framework/Headers/CTDefines.h:12:10: fatal error: could not build module 'Darwin'
#include <Availability.h>
 ~~~~~~~~^
While building module 'UIKit' imported from SCLAlertView/SCLAlertView.h:10:
While building module 'FileProvider' imported from /home/1/theos/sdks/iPhoneOS11.2.sdk/System/Library/Frameworks/UIKit.framework/Headers/NSFileProviderExtension.h:14:
In file included from <module-includes>:1:
In file included from /home/1/theos/sdks/iPhoneOS11.2.sdk/System/Library/Frameworks/FileProvider.framework/Headers/FileProvider.h:8:
/home/1/theos/sdks/iPhoneOS11.2.sdk/System/Library/Frameworks/FileProvider.framework/Headers/NSFileProviderDomain.h:8:9: fatal error: could not build module 'Foundation'
#import <Foundation/Foundation.h>
 ~~~~~~~^
26 errors generated.
make[3]: *** [/home/1/theos/makefiles/instance/rules.mk:197: /home/1/standoff2/.theos/obj/arm64/SCLAlertView/SCLAlertViewResponder.m.f1450fb4.o] Error 1
==> Compiling KittyMemory/MemoryBackup.cpp (arm64)…
While building module 'Darwin' imported from /home/1/theos/include/bits/os_defines.h:61:
In file included from <module-includes>:215:
/home/1/theos/sdks/iPhoneOS11.2.sdk/usr/include/pthread.h:1:1: error: unknown type name 'pthread'; did you mean 'pthread_t'?
pthread/pthread.h
^
/home/1/theos/sdks/iPhoneOS11.2.sdk/usr/include/sys/_pthread/_pthread_t.h:31:28: note: 'pthread_t' declared here
typedef __darwin_pthread_t pthread_t;
                           ^
While building module 'Darwin' imported from /home/1/theos/include/bits/os_defines.h:61:
In file included from <module-includes>:215:
/home/1/theos/sdks/iPhoneOS11.2.sdk/usr/include/pthread.h:1:8: error: expected unqualified-id
pthread/pthread.h
       ^
While building module 'Darwin' imported from /home/1/theos/include/bits/os_defines.h:61:
In file included from <module-includes>:218:
/home/1/theos/sdks/iPhoneOS11.2.sdk/usr/include/pthread_impl.h:1:1: error: unknown type name 'pthread'; did you mean 'pthread_t'?
pthread/pthread_impl.h
^
/home/1/theos/sdks/iPhoneOS11.2.sdk/usr/include/sys/_pthread/_pthread_t.h:31:28: note: 'pthread_t' declared here
typedef __darwin_pthread_t pthread_t;
                           ^
While building module 'Darwin' imported from /home/1/theos/include/bits/os_defines.h:61:
In file included from <module-includes>:218:
/home/1/theos/sdks/iPhoneOS11.2.sdk/usr/include/pthread_impl.h:1:8: error: expected unqualified-id
pthread/pthread_impl.h
       ^
While building module 'Darwin' imported from /home/1/theos/include/bits/os_defines.h:61:
In file included from <module-includes>:224:
/home/1/theos/sdks/iPhoneOS11.2.sdk/usr/include/pthread_spis.h:1:1: error: unknown type name 'pthread'; did you mean 'pthread_t'?
pthread/pthread_spis.h
^
/home/1/theos/sdks/iPhoneOS11.2.sdk/usr/include/sys/_pthread/_pthread_t.h:31:28: note: 'pthread_t' declared here
typedef __darwin_pthread_t pthread_t;
                           ^
While building module 'Darwin' imported from /home/1/theos/include/bits/os_defines.h:61:
In file included from <module-includes>:224:
/home/1/theos/sdks/iPhoneOS11.2.sdk/usr/include/pthread_spis.h:1:8: error: expected unqualified-id
pthread/pthread_spis.h
       ^
While building module 'Darwin' imported from /home/1/theos/include/bits/os_defines.h:61:
In file included from <module-includes>:227:
In file included from /home/1/theos/sdks/iPhoneOS11.2.sdk/usr/include/pthread/spawn.h:32:
In file included from /home/1/theos/sdks/iPhoneOS11.2.sdk/usr/include/pthread/pthread.h:59:
In file included from /home/1/theos/sdks/iPhoneOS11.2.sdk/usr/include/pthread/sched.h:28:
/home/1/theos/sdks/iPhoneOS11.2.sdk/usr/include/pthread_impl.h:1:1: error: unknown type name 'pthread'; did you mean 'pthread_t'?
pthread/pthread_impl.h
^
/home/1/theos/sdks/iPhoneOS11.2.sdk/usr/include/sys/_pthread/_pthread_t.h:31:28: note: 'pthread_t' declared here
typedef __darwin_pthread_t pthread_t;
                           ^
While building module 'Darwin' imported from /home/1/theos/include/bits/os_defines.h:61:
In file included from <module-includes>:227:
In file included from /home/1/theos/sdks/iPhoneOS11.2.sdk/usr/include/pthread/spawn.h:32:
In file included from /home/1/theos/sdks/iPhoneOS11.2.sdk/usr/include/pthread/pthread.h:59:
In file included from /home/1/theos/sdks/iPhoneOS11.2.sdk/usr/include/pthread/sched.h:28:
/home/1/theos/sdks/iPhoneOS11.2.sdk/usr/include/pthread_impl.h:1:8: error: expected unqualified-id
pthread/pthread_impl.h
       ^
While building module 'Darwin' imported from /home/1/theos/include/bits/os_defines.h:61:
In file included from <module-includes>:236:
/home/1/theos/sdks/iPhoneOS11.2.sdk/usr/include/sched.h:1:1: error: unknown type name 'pthread'; did you mean 'pthread_t'?
pthread/sched.h
^
/home/1/theos/sdks/iPhoneOS11.2.sdk/usr/include/sys/_pthread/_pthread_t.h:31:28: note: 'pthread_t' declared here
typedef __darwin_pthread_t pthread_t;
                           ^
While building module 'Darwin' imported from /home/1/theos/include/bits/os_defines.h:61:
In file included from <module-includes>:236:
/home/1/theos/sdks/iPhoneOS11.2.sdk/usr/include/sched.h:1:8: error: expected unqualified-id
pthread/sched.h
       ^
In file included from KittyMemory/MemoryBackup.cpp:7:
In file included from KittyMemory/MemoryBackup.hpp:9:
In file included from /home/1/theos/include/vector:65:
In file included from /home/1/theos/include/bits/functexcept.h:41:
In file included from /home/1/theos/include/bits/c++config.h:41:
/home/1/theos/include/bits/os_defines.h:61:10: fatal error: could not build module 'Darwin'
#include <unistd.h>
 ~~~~~~~~^
While building module 'MachO' imported from KittyMemory/KittyMemory.hpp:16:
In file included from <module-includes>:2:
/home/1/theos/sdks/iPhoneOS11.2.sdk/usr/include/mach-o/arch.h:32:10: fatal error: could not build module 'Darwin'
#include <stdint.h>
 ~~~~~~~~^
While building module 'libkern' imported from KittyMemory/KittyMemory.hpp:18:
In file included from <module-includes>:2:
/home/1/theos/sdks/iPhoneOS11.2.sdk/usr/include/libkern/OSCacheControl.h:27:13: fatal error: could not build module 'Darwin'
#include    <stddef.h>
 ~~~~~~~~~~~^
13 errors generated.
make[3]: *** [/home/1/theos/makefiles/instance/rules.mk:241: /home/1/standoff2/.theos/obj/arm64/KittyMemory/MemoryBackup.cpp.f1450fb4.o] Error 1
==> Compiling SCLAlertView/SCLAlertViewStyleKit.m (arm64)…
In file included from <built-in>:1:
/home/1/theos/Prefix.pch:24:12: fatal error: could not acquire lock file for module 'Darwin': failed to create link /tmp/org.llvm.clang.197609/ModuleCache/1OED6BXA73FIR/Darwin-3ETN8VFHP0WSE.pcm.lock to /tmp/org.llvm.clang.197609/ModuleCache/1OED6BXA73FIR/Darwin-3ETN8VFHP0WSE.pcm.lock-19e8d28c: Permission denied
                        #import <TargetConditionals.h>
                                ^
While building module 'Foundation' imported from SCLAlertView/SCLAlertViewStyleKit.h:10:
While building module 'CoreFoundation' imported from /home/1/theos/sdks/iPhoneOS11.2.sdk/System/Library/Frameworks/Foundation.framework/Headers/Foundation.h:6:
While building module 'Darwin' imported from /home/1/theos/sdks/iPhoneOS11.2.sdk/System/Library/Frameworks/CoreFoundation.framework/Headers/CoreFoundation.h:16:
In file included from <module-includes>:72:
/home/1/theos/sdks/iPhoneOS11.2.sdk/usr/include/pthread.h:1:1: error: unknown type name 'pthread'; did you mean 'pthread_t'?
pthread/pthread.h
^
/home/1/theos/sdks/iPhoneOS11.2.sdk/usr/include/sys/_pthread/_pthread_t.h:31:28: note: 'pthread_t' declared here
typedef __darwin_pthread_t pthread_t;
                           ^
While building module 'Foundation' imported from SCLAlertView/SCLAlertViewStyleKit.h:10:
While building module 'CoreFoundation' imported from /home/1/theos/sdks/iPhoneOS11.2.sdk/System/Library/Frameworks/Foundation.framework/Headers/Foundation.h:6:
While building module 'Darwin' imported from /home/1/theos/sdks/iPhoneOS11.2.sdk/System/Library/Frameworks/CoreFoundation.framework/Headers/CoreFoundation.h:16:
In file included from <module-includes>:72:
/home/1/theos/sdks/iPhoneOS11.2.sdk/usr/include/pthread.h:1:8: error: expected identifier or '('
pthread/pthread.h
       ^
While building module 'Foundation' imported from SCLAlertView/SCLAlertViewStyleKit.h:10:
While building module 'CoreFoundation' imported from /home/1/theos/sdks/iPhoneOS11.2.sdk/System/Library/Frameworks/Foundation.framework/Headers/Foundation.h:6:
While building module 'Darwin' imported from /home/1/theos/sdks/iPhoneOS11.2.sdk/System/Library/Frameworks/CoreFoundation.framework/Headers/CoreFoundation.h:16:
In file included from <module-includes>:73:
/home/1/theos/sdks/iPhoneOS11.2.sdk/usr/include/pthread_impl.h:1:1: error: unknown type name 'pthread'; did you mean 'pthread_t'?
pthread/pthread_impl.h
^
/home/1/theos/sdks/iPhoneOS11.2.sdk/usr/include/sys/_pthread/_pthread_t.h:31:28: note: 'pthread_t' declared here
typedef __darwin_pthread_t pthread_t;
                           ^
While building module 'Foundation' imported from SCLAlertView/SCLAlertViewStyleKit.h:10:
While building module 'CoreFoundation' imported from /home/1/theos/sdks/iPhoneOS11.2.sdk/System/Library/Frameworks/Foundation.framework/Headers/Foundation.h:6:
While building module 'Darwin' imported from /home/1/theos/sdks/iPhoneOS11.2.sdk/System/Library/Frameworks/CoreFoundation.framework/Headers/CoreFoundation.h:16:
In file included from <module-includes>:73:
/home/1/theos/sdks/iPhoneOS11.2.sdk/usr/include/pthread_impl.h:1:8: error: expected identifier or '('
pthread/pthread_impl.h
       ^
While building module 'Foundation' imported from SCLAlertView/SCLAlertViewStyleKit.h:10:
While building module 'CoreFoundation' imported from /home/1/theos/sdks/iPhoneOS11.2.sdk/System/Library/Frameworks/Foundation.framework/Headers/Foundation.h:6:
While building module 'Darwin' imported from /home/1/theos/sdks/iPhoneOS11.2.sdk/System/Library/Frameworks/CoreFoundation.framework/Headers/CoreFoundation.h:16:
In file included from <module-includes>:75:
/home/1/theos/sdks/iPhoneOS11.2.sdk/usr/include/pthread_spis.h:1:1: error: unknown type name 'pthread'; did you mean 'pthread_t'?
pthread/pthread_spis.h
^
/home/1/theos/sdks/iPhoneOS11.2.sdk/usr/include/sys/_pthread/_pthread_t.h:31:28: note: 'pthread_t' declared here
typedef __darwin_pthread_t pthread_t;
                           ^
While building module 'Foundation' imported from SCLAlertView/SCLAlertViewStyleKit.h:10:
While building module 'CoreFoundation' imported from /home/1/theos/sdks/iPhoneOS11.2.sdk/System/Library/Frameworks/Foundation.framework/Headers/Foundation.h:6:
While building module 'Darwin' imported from /home/1/theos/sdks/iPhoneOS11.2.sdk/System/Library/Frameworks/CoreFoundation.framework/Headers/CoreFoundation.h:16:
In file included from <module-includes>:75:
/home/1/theos/sdks/iPhoneOS11.2.sdk/usr/include/pthread_spis.h:1:8: error: expected identifier or '('
pthread/pthread_spis.h
       ^
While building module 'Foundation' imported from SCLAlertView/SCLAlertViewStyleKit.h:10:
While building module 'CoreFoundation' imported from /home/1/theos/sdks/iPhoneOS11.2.sdk/System/Library/Frameworks/Foundation.framework/Headers/Foundation.h:6:
While building module 'Darwin' imported from /home/1/theos/sdks/iPhoneOS11.2.sdk/System/Library/Frameworks/CoreFoundation.framework/Headers/CoreFoundation.h:16:
In file included from <module-includes>:79:
/home/1/theos/sdks/iPhoneOS11.2.sdk/usr/include/sched.h:1:1: error: unknown type name 'pthread'; did you mean 'pthread_t'?
pthread/sched.h
^
/home/1/theos/sdks/iPhoneOS11.2.sdk/usr/include/sys/_pthread/_pthread_t.h:31:28: note: 'pthread_t' declared here
typedef __darwin_pthread_t pthread_t;
                           ^
While building module 'Foundation' imported from SCLAlertView/SCLAlertViewStyleKit.h:10:
While building module 'CoreFoundation' imported from /home/1/theos/sdks/iPhoneOS11.2.sdk/System/Library/Frameworks/Foundation.framework/Headers/Foundation.h:6:
While building module 'Darwin' imported from /home/1/theos/sdks/iPhoneOS11.2.sdk/System/Library/Frameworks/CoreFoundation.framework/Headers/CoreFoundation.h:16:
In file included from <module-includes>:79:
/home/1/theos/sdks/iPhoneOS11.2.sdk/usr/include/sched.h:1:8: error: expected identifier or '('
pthread/sched.h
       ^
While building module 'Foundation' imported from SCLAlertView/SCLAlertViewStyleKit.h:10:
While building module 'CoreFoundation' imported from /home/1/theos/sdks/iPhoneOS11.2.sdk/System/Library/Frameworks/Foundation.framework/Headers/Foundation.h:6:
In file included from <module-includes>:1:
/home/1/theos/sdks/iPhoneOS11.2.sdk/System/Library/Frameworks/CoreFoundation.framework/Headers/CoreFoundation.h:16:10: fatal error: could not build module 'Darwin'
#include <sys/types.h>
 ~~~~~~~~^
While building module 'Foundation' imported from SCLAlertView/SCLAlertViewStyleKit.h:10:
While building module 'CoreFoundation' imported from /home/1/theos/sdks/iPhoneOS11.2.sdk/System/Library/Frameworks/Foundation.framework/Headers/Foundation.h:6:
While building module 'Dispatch' imported from /home/1/theos/sdks/iPhoneOS11.2.sdk/System/Library/Frameworks/CoreFoundation.framework/Headers/CFStream.h:20:
In file included from <module-includes>:1:
/home/1/theos/sdks/iPhoneOS11.2.sdk/usr/include/dispatch/dispatch.h:25:10: fatal error: could not build module 'Darwin'
#include <Availability.h>
 ~~~~~~~~^
While building module 'Foundation' imported from SCLAlertView/SCLAlertViewStyleKit.h:10:
While building module 'CoreFoundation' imported from /home/1/theos/sdks/iPhoneOS11.2.sdk/System/Library/Frameworks/Foundation.framework/Headers/Foundation.h:6:
While building module 'Dispatch' imported from /home/1/theos/sdks/iPhoneOS11.2.sdk/System/Library/Frameworks/CoreFoundation.framework/Headers/CFStream.h:20:
While building module 'os_object' imported from /home/1/theos/sdks/iPhoneOS11.2.sdk/usr/include/dispatch/dispatch.h:59:
In file included from <module-includes>:1:
/home/1/theos/sdks/iPhoneOS11.2.sdk/usr/include/os/object.h:25:10: fatal error: could not build module 'Darwin'
#include <Availability.h>
 ~~~~~~~~^
While building module 'Foundation' imported from SCLAlertView/SCLAlertViewStyleKit.h:10:
In file included from <module-includes>:1:
/home/1/theos/sdks/iPhoneOS11.2.sdk/System/Library/Frameworks/Foundation.framework/Headers/Foundation.h:6:10: fatal error: could not build module 'CoreFoundation'
#include <CoreFoundation/CoreFoundation.h>
 ~~~~~~~~^
While building module 'Foundation' imported from SCLAlertView/SCLAlertViewStyleKit.h:10:
While building module 'ObjectiveC' imported from /home/1/theos/sdks/iPhoneOS11.2.sdk/System/Library/Frameworks/Foundation.framework/Headers/NSObject.h:6:
In file included from <module-includes>:1:
In file included from /home/1/theos/sdks/iPhoneOS11.2.sdk/usr/include/objc/./message.h:27:
/home/1/theos/sdks/iPhoneOS11.2.sdk/usr/include/objc/objc.h:31:10: fatal error: could not build module 'Darwin'
#include <sys/types.h>      // for __DARWIN_NULL
 ~~~~~~~~^
While building module 'Foundation' imported from SCLAlertView/SCLAlertViewStyleKit.h:10:
While building module 'Security' imported from /home/1/theos/sdks/iPhoneOS11.2.sdk/System/Library/Frameworks/Foundation.framework/Headers/NSURLCredential.h:9:
In file included from <module-includes>:1:
In file included from /home/1/theos/sdks/iPhoneOS11.2.sdk/System/Library/Frameworks/Security.framework/Headers/Security.h:27:
/home/1/theos/sdks/iPhoneOS11.2.sdk/System/Library/Frameworks/Security.framework/Headers/SecBase.h:27:10: fatal error: could not build module 'Darwin'
#include <TargetConditionals.h>
 ~~~~~~~~^
While building module 'UIKit' imported from SCLAlertView/SCLAlertViewStyleKit.h:11:
In file included from <module-includes>:1:
In file included from /home/1/theos/sdks/iPhoneOS11.2.sdk/System/Library/Frameworks/UIKit.framework/Headers/UIKit.h:8:
/home/1/theos/sdks/iPhoneOS11.2.sdk/System/Library/Frameworks/UIKit.framework/Headers/UIKitDefines.h:8:9: fatal error: could not build module 'Darwin'
#import <Availability.h>
 ~~~~~~~^
While building module 'UIKit' imported from SCLAlertView/SCLAlertViewStyleKit.h:11:
While building module 'CoreGraphics' imported from /home/1/theos/sdks/iPhoneOS11.2.sdk/System/Library/Frameworks/UIKit.framework/Headers/UIAccessibility.h:9:
In file included from <module-includes>:1:
In file included from /home/1/theos/sdks/iPhoneOS11.2.sdk/System/Library/Frameworks/CoreGraphics.framework/Headers/CoreGraphics.h:8:
/home/1/theos/sdks/iPhoneOS11.2.sdk/System/Library/Frameworks/CoreGraphics.framework/Headers/CGBase.h:8:10: fatal error: could not build module 'Darwin'
#include <stdbool.h>
 ~~~~~~~~^
While building module 'UIKit' imported from SCLAlertView/SCLAlertViewStyleKit.h:11:
While building module 'QuartzCore' imported from /home/1/theos/sdks/iPhoneOS11.2.sdk/System/Library/Frameworks/UIKit.framework/Headers/UIView.h:9:
In file included from <module-includes>:1:
In file included from /home/1/theos/sdks/iPhoneOS11.2.sdk/System/Library/Frameworks/QuartzCore.framework/Headers/QuartzCore.h:9:
In file included from /home/1/theos/sdks/iPhoneOS11.2.sdk/System/Library/Frameworks/QuartzCore.framework/Headers/CoreAnimation.h:9:
/home/1/theos/sdks/iPhoneOS11.2.sdk/System/Library/Frameworks/QuartzCore.framework/Headers/CABase.h:11:10: fatal error: could not build module 'Darwin'
#include <stdbool.h>
 ~~~~~~~~^
While building module 'UIKit' imported from SCLAlertView/SCLAlertViewStyleKit.h:11:
While building module 'QuartzCore' imported from /home/1/theos/sdks/iPhoneOS11.2.sdk/System/Library/Frameworks/UIKit.framework/Headers/UIView.h:9:
While building module 'OpenGLES' imported from /home/1/theos/sdks/iPhoneOS11.2.sdk/System/Library/Frameworks/QuartzCore.framework/Headers/CAEAGLLayer.h:7:
In file included from <module-includes>:1:
/home/1/theos/sdks/iPhoneOS11.2.sdk/System/Library/Frameworks/OpenGLES.framework/Headers/EAGL.h:8:10: fatal error: could not build module 'Foundation'
#include <Foundation/Foundation.h>
 ~~~~~~~~^
While building module 'UIKit' imported from SCLAlertView/SCLAlertViewStyleKit.h:11:
While building module 'QuartzCore' imported from /home/1/theos/sdks/iPhoneOS11.2.sdk/System/Library/Frameworks/UIKit.framework/Headers/UIView.h:9:
While building module 'Metal' imported from /home/1/theos/sdks/iPhoneOS11.2.sdk/System/Library/Frameworks/QuartzCore.framework/Headers/CAMetalLayer.h:7:
In file included from <module-includes>:1:
In file included from /home/1/theos/sdks/iPhoneOS11.2.sdk/System/Library/Frameworks/Metal.framework/Headers/Metal.h:8:
/home/1/theos/sdks/iPhoneOS11.2.sdk/System/Library/Frameworks/Metal.framework/Headers/MTLDefines.h:8:9: fatal error: could not build module 'Darwin'
#import <Availability.h>
 ~~~~~~~^
While building module 'UIKit' imported from SCLAlertView/SCLAlertViewStyleKit.h:11:
While building module 'QuartzCore' imported from /home/1/theos/sdks/iPhoneOS11.2.sdk/System/Library/Frameworks/UIKit.framework/Headers/UIView.h:9:
While building module 'Metal' imported from /home/1/theos/sdks/iPhoneOS11.2.sdk/System/Library/Frameworks/QuartzCore.framework/Headers/CAMetalLayer.h:7:
While building module 'IOSurface' imported from /home/1/theos/sdks/iPhoneOS11.2.sdk/System/Library/Frameworks/Metal.framework/Headers/MTLTexture.h:15:
In file included from <module-includes>:1:
/home/1/theos/sdks/iPhoneOS11.2.sdk/System/Library/Frameworks/IOSurface.framework/Headers/IOSurfaceBase.h:12:10: fatal error: could not build module 'Darwin'
#include <sys/cdefs.h>
 ~~~~~~~~^
While building module 'UIKit' imported from SCLAlertView/SCLAlertViewStyleKit.h:11:
While building module 'CoreImage' imported from /home/1/theos/sdks/iPhoneOS11.2.sdk/System/Library/Frameworks/UIKit.framework/Headers/UIColor.h:11:
In file included from <module-includes>:1:
In file included from /home/1/theos/sdks/iPhoneOS11.2.sdk/System/Library/Frameworks/CoreImage.framework/Headers/CoreImage.h:8:
/home/1/theos/sdks/iPhoneOS11.2.sdk/System/Library/Frameworks/CoreImage.framework/Headers/CoreImageDefines.h:10:10: fatal error: could not build module 'Darwin'
#include <TargetConditionals.h>
 ~~~~~~~~^
While building module 'UIKit' imported from SCLAlertView/SCLAlertViewStyleKit.h:11:
While building module 'CoreImage' imported from /home/1/theos/sdks/iPhoneOS11.2.sdk/System/Library/Frameworks/UIKit.framework/Headers/UIColor.h:11:
While building module 'CoreVideo' imported from /home/1/theos/sdks/iPhoneOS11.2.sdk/System/Library/Frameworks/CoreImage.framework/Headers/CIImage.h:10:
In file included from <module-includes>:1:
/home/1/theos/sdks/iPhoneOS11.2.sdk/System/Library/Frameworks/CoreVideo.framework/Headers/CoreVideo.h:16:10: fatal error: could not build module 'Darwin'
#include <TargetConditionals.h>
 ~~~~~~~~^
While building module 'UIKit' imported from SCLAlertView/SCLAlertViewStyleKit.h:11:
While building module 'CoreImage' imported from /home/1/theos/sdks/iPhoneOS11.2.sdk/System/Library/Frameworks/UIKit.framework/Headers/UIColor.h:11:
While building module 'ImageIO' imported from /home/1/theos/sdks/iPhoneOS11.2.sdk/System/Library/Frameworks/CoreImage.framework/Headers/CIImage.h:11:
In file included from <module-includes>:1:
In file included from /home/1/theos/sdks/iPhoneOS11.2.sdk/System/Library/Frameworks/ImageIO.framework/Headers/ImageIO.h:10:
/home/1/theos/sdks/iPhoneOS11.2.sdk/System/Library/Frameworks/ImageIO.framework/Headers/ImageIOBase.h:11:10: fatal error: could not build module 'CoreFoundation'
#include <CoreFoundation/CoreFoundation.h>
 ~~~~~~~~^
While building module 'UIKit' imported from SCLAlertView/SCLAlertViewStyleKit.h:11:
While building module 'CoreText' imported from /home/1/theos/sdks/iPhoneOS11.2.sdk/System/Library/Frameworks/UIKit.framework/Headers/NSText.h:10:
In file included from <module-includes>:1:
In file included from /home/1/theos/sdks/iPhoneOS11.2.sdk/System/Library/Frameworks/CoreText.framework/Headers/CoreText.h:20:
/home/1/theos/sdks/iPhoneOS11.2.sdk/System/Library/Frameworks/CoreText.framework/Headers/CTDefines.h:12:10: fatal error: could not build module 'Darwin'
#include <Availability.h>
 ~~~~~~~~^
While building module 'UIKit' imported from SCLAlertView/SCLAlertViewStyleKit.h:11:
While building module 'FileProvider' imported from /home/1/theos/sdks/iPhoneOS11.2.sdk/System/Library/Frameworks/UIKit.framework/Headers/NSFileProviderExtension.h:14:
In file included from <module-includes>:1:
In file included from /home/1/theos/sdks/iPhoneOS11.2.sdk/System/Library/Frameworks/FileProvider.framework/Headers/FileProvider.h:8:
/home/1/theos/sdks/iPhoneOS11.2.sdk/System/Library/Frameworks/FileProvider.framework/Headers/NSFileProviderDomain.h:8:9: fatal error: could not build module 'Foundation'
#import <Foundation/Foundation.h>
 ~~~~~~~^
26 errors generated.
make[3]: *** [/home/1/theos/makefiles/instance/rules.mk:197: /home/1/standoff2/.theos/obj/arm64/SCLAlertView/SCLAlertViewStyleKit.m.f1450fb4.o] Error 1
==> Compiling SCLAlertView/SCLSwitchView.m (arm64)…
While building module 'Darwin' imported from /home/1/theos/Prefix.pch:24:
In file included from <module-includes>:72:
/home/1/theos/sdks/iPhoneOS11.2.sdk/usr/include/pthread.h:1:1: error: unknown type name 'pthread'; did you mean 'pthread_t'?
pthread/pthread.h
^
/home/1/theos/sdks/iPhoneOS11.2.sdk/usr/include/sys/_pthread/_pthread_t.h:31:28: note: 'pthread_t' declared here
typedef __darwin_pthread_t pthread_t;
                           ^
While building module 'Darwin' imported from /home/1/theos/Prefix.pch:24:
In file included from <module-includes>:72:
/home/1/theos/sdks/iPhoneOS11.2.sdk/usr/include/pthread.h:1:8: error: expected identifier or '('
pthread/pthread.h
       ^
While building module 'Darwin' imported from /home/1/theos/Prefix.pch:24:
In file included from <module-includes>:73:
/home/1/theos/sdks/iPhoneOS11.2.sdk/usr/include/pthread_impl.h:1:1: error: unknown type name 'pthread'; did you mean 'pthread_t'?
pthread/pthread_impl.h
^
/home/1/theos/sdks/iPhoneOS11.2.sdk/usr/include/sys/_pthread/_pthread_t.h:31:28: note: 'pthread_t' declared here
typedef __darwin_pthread_t pthread_t;
                           ^
While building module 'Darwin' imported from /home/1/theos/Prefix.pch:24:
In file included from <module-includes>:73:
/home/1/theos/sdks/iPhoneOS11.2.sdk/usr/include/pthread_impl.h:1:8: error: expected identifier or '('
pthread/pthread_impl.h
       ^
While building module 'Darwin' imported from /home/1/theos/Prefix.pch:24:
In file included from <module-includes>:75:
/home/1/theos/sdks/iPhoneOS11.2.sdk/usr/include/pthread_spis.h:1:1: error: unknown type name 'pthread'; did you mean 'pthread_t'?
pthread/pthread_spis.h
^
/home/1/theos/sdks/iPhoneOS11.2.sdk/usr/include/sys/_pthread/_pthread_t.h:31:28: note: 'pthread_t' declared here
typedef __darwin_pthread_t pthread_t;
                           ^
While building module 'Darwin' imported from /home/1/theos/Prefix.pch:24:
In file included from <module-includes>:75:
/home/1/theos/sdks/iPhoneOS11.2.sdk/usr/include/pthread_spis.h:1:8: error: expected identifier or '('
pthread/pthread_spis.h
       ^
While building module 'Darwin' imported from /home/1/theos/Prefix.pch:24:
In file included from <module-includes>:79:
/home/1/theos/sdks/iPhoneOS11.2.sdk/usr/include/sched.h:1:1: error: unknown type name 'pthread'; did you mean 'pthread_t'?
pthread/sched.h
^
/home/1/theos/sdks/iPhoneOS11.2.sdk/usr/include/sys/_pthread/_pthread_t.h:31:28: note: 'pthread_t' declared here
typedef __darwin_pthread_t pthread_t;
                           ^
While building module 'Darwin' imported from /home/1/theos/Prefix.pch:24:
In file included from <module-includes>:79:
/home/1/theos/sdks/iPhoneOS11.2.sdk/usr/include/sched.h:1:8: error: expected identifier or '('
pthread/sched.h
       ^
In file included from <built-in>:1:
/home/1/theos/Prefix.pch:24:12: fatal error: could not build module 'Darwin'
                        #import <TargetConditionals.h>
                         ~~~~~~~^
While building module 'UIKit' imported from SCLAlertView/SCLSwitchView.h:10:
In file included from <module-includes>:1:
In file included from /home/1/theos/sdks/iPhoneOS11.2.sdk/System/Library/Frameworks/UIKit.framework/Headers/UIKit.h:8:
/home/1/theos/sdks/iPhoneOS11.2.sdk/System/Library/Frameworks/UIKit.framework/Headers/UIKitDefines.h:8:9: fatal error: could not build module 'Darwin'
#import <Availability.h>
 ~~~~~~~^
While building module 'UIKit' imported from SCLAlertView/SCLSwitchView.h:10:
While building module 'Foundation' imported from /home/1/theos/sdks/iPhoneOS11.2.sdk/System/Library/Frameworks/UIKit.framework/Headers/UIAccelerometer.h:8:
While building module 'CoreFoundation' imported from /home/1/theos/sdks/iPhoneOS11.2.sdk/System/Library/Frameworks/Foundation.framework/Headers/Foundation.h:6:
In file included from <module-includes>:1:
/home/1/theos/sdks/iPhoneOS11.2.sdk/System/Library/Frameworks/CoreFoundation.framework/Headers/CoreFoundation.h:16:10: fatal error: could not build module 'Darwin'
#include <sys/types.h>
 ~~~~~~~~^
While building module 'UIKit' imported from SCLAlertView/SCLSwitchView.h:10:
While building module 'Foundation' imported from /home/1/theos/sdks/iPhoneOS11.2.sdk/System/Library/Frameworks/UIKit.framework/Headers/UIAccelerometer.h:8:
While building module 'CoreFoundation' imported from /home/1/theos/sdks/iPhoneOS11.2.sdk/System/Library/Frameworks/Foundation.framework/Headers/Foundation.h:6:
While building module 'Dispatch' imported from /home/1/theos/sdks/iPhoneOS11.2.sdk/System/Library/Frameworks/CoreFoundation.framework/Headers/CFStream.h:20:
In file included from <module-includes>:1:
/home/1/theos/sdks/iPhoneOS11.2.sdk/usr/include/dispatch/dispatch.h:25:10: fatal error: could not build module 'Darwin'
#include <Availability.h>
 ~~~~~~~~^
While building module 'UIKit' imported from SCLAlertView/SCLSwitchView.h:10:
While building module 'Foundation' imported from /home/1/theos/sdks/iPhoneOS11.2.sdk/System/Library/Frameworks/UIKit.framework/Headers/UIAccelerometer.h:8:
While building module 'CoreFoundation' imported from /home/1/theos/sdks/iPhoneOS11.2.sdk/System/Library/Frameworks/Foundation.framework/Headers/Foundation.h:6:
While building module 'Dispatch' imported from /home/1/theos/sdks/iPhoneOS11.2.sdk/System/Library/Frameworks/CoreFoundation.framework/Headers/CFStream.h:20:
While building module 'os_object' imported from /home/1/theos/sdks/iPhoneOS11.2.sdk/usr/include/dispatch/dispatch.h:59:
In file included from <module-includes>:1:
/home/1/theos/sdks/iPhoneOS11.2.sdk/usr/include/os/object.h:25:10: fatal error: could not build module 'Darwin'
#include <Availability.h>
 ~~~~~~~~^
While building module 'UIKit' imported from SCLAlertView/SCLSwitchView.h:10:
While building module 'Foundation' imported from /home/1/theos/sdks/iPhoneOS11.2.sdk/System/Library/Frameworks/UIKit.framework/Headers/UIAccelerometer.h:8:
In file included from <module-includes>:1:
/home/1/theos/sdks/iPhoneOS11.2.sdk/System/Library/Frameworks/Foundation.framework/Headers/Foundation.h:6:10: fatal error: could not build module 'CoreFoundation'
#include <CoreFoundation/CoreFoundation.h>
 ~~~~~~~~^
While building module 'UIKit' imported from SCLAlertView/SCLSwitchView.h:10:
While building module 'Foundation' imported from /home/1/theos/sdks/iPhoneOS11.2.sdk/System/Library/Frameworks/UIKit.framework/Headers/UIAccelerometer.h:8:
While building module 'ObjectiveC' imported from /home/1/theos/sdks/iPhoneOS11.2.sdk/System/Library/Frameworks/Foundation.framework/Headers/NSObject.h:6:
In file included from <module-includes>:1:
In file included from /home/1/theos/sdks/iPhoneOS11.2.sdk/usr/include/objc/./message.h:27:
/home/1/theos/sdks/iPhoneOS11.2.sdk/usr/include/objc/objc.h:31:10: fatal error: could not build module 'Darwin'
#include <sys/types.h>      // for __DARWIN_NULL
 ~~~~~~~~^
While building module 'UIKit' imported from SCLAlertView/SCLSwitchView.h:10:
While building module 'Foundation' imported from /home/1/theos/sdks/iPhoneOS11.2.sdk/System/Library/Frameworks/UIKit.framework/Headers/UIAccelerometer.h:8:
While building module 'Security' imported from /home/1/theos/sdks/iPhoneOS11.2.sdk/System/Library/Frameworks/Foundation.framework/Headers/NSURLCredential.h:9:
In file included from <module-includes>:1:
In file included from /home/1/theos/sdks/iPhoneOS11.2.sdk/System/Library/Frameworks/Security.framework/Headers/Security.h:27:
/home/1/theos/sdks/iPhoneOS11.2.sdk/System/Library/Frameworks/Security.framework/Headers/SecBase.h:27:10: fatal error: could not build module 'Darwin'
#include <TargetConditionals.h>
 ~~~~~~~~^
While building module 'UIKit' imported from SCLAlertView/SCLSwitchView.h:10:
While building module 'CoreGraphics' imported from /home/1/theos/sdks/iPhoneOS11.2.sdk/System/Library/Frameworks/UIKit.framework/Headers/UIAccessibility.h:9:
In file included from <module-includes>:1:
In file included from /home/1/theos/sdks/iPhoneOS11.2.sdk/System/Library/Frameworks/CoreGraphics.framework/Headers/CoreGraphics.h:8:
/home/1/theos/sdks/iPhoneOS11.2.sdk/System/Library/Frameworks/CoreGraphics.framework/Headers/CGBase.h:8:10: fatal error: could not build module 'Darwin'
#include <stdbool.h>
 ~~~~~~~~^
While building module 'UIKit' imported from SCLAlertView/SCLSwitchView.h:10:
While building module 'QuartzCore' imported from /home/1/theos/sdks/iPhoneOS11.2.sdk/System/Library/Frameworks/UIKit.framework/Headers/UIView.h:9:
In file included from <module-includes>:1:
In file included from /home/1/theos/sdks/iPhoneOS11.2.sdk/System/Library/Frameworks/QuartzCore.framework/Headers/QuartzCore.h:9:
In file included from /home/1/theos/sdks/iPhoneOS11.2.sdk/System/Library/Frameworks/QuartzCore.framework/Headers/CoreAnimation.h:9:
/home/1/theos/sdks/iPhoneOS11.2.sdk/System/Library/Frameworks/QuartzCore.framework/Headers/CABase.h:11:10: fatal error: could not build module 'Darwin'
#include <stdbool.h>
 ~~~~~~~~^
While building module 'UIKit' imported from SCLAlertView/SCLSwitchView.h:10:
While building module 'QuartzCore' imported from /home/1/theos/sdks/iPhoneOS11.2.sdk/System/Library/Frameworks/UIKit.framework/Headers/UIView.h:9:
While building module 'OpenGLES' imported from /home/1/theos/sdks/iPhoneOS11.2.sdk/System/Library/Frameworks/QuartzCore.framework/Headers/CAEAGLLayer.h:7:
In file included from <module-includes>:1:
/home/1/theos/sdks/iPhoneOS11.2.sdk/System/Library/Frameworks/OpenGLES.framework/Headers/EAGL.h:8:10: fatal error: could not build module 'Foundation'
#include <Foundation/Foundation.h>
 ~~~~~~~~^
While building module 'UIKit' imported from SCLAlertView/SCLSwitchView.h:10:
While building module 'QuartzCore' imported from /home/1/theos/sdks/iPhoneOS11.2.sdk/System/Library/Frameworks/UIKit.framework/Headers/UIView.h:9:
While building module 'Metal' imported from /home/1/theos/sdks/iPhoneOS11.2.sdk/System/Library/Frameworks/QuartzCore.framework/Headers/CAMetalLayer.h:7:
In file included from <module-includes>:1:
In file included from /home/1/theos/sdks/iPhoneOS11.2.sdk/System/Library/Frameworks/Metal.framework/Headers/Metal.h:8:
/home/1/theos/sdks/iPhoneOS11.2.sdk/System/Library/Frameworks/Metal.framework/Headers/MTLDefines.h:8:9: fatal error: could not build module 'Darwin'
#import <Availability.h>
 ~~~~~~~^
While building module 'UIKit' imported from SCLAlertView/SCLSwitchView.h:10:
While building module 'QuartzCore' imported from /home/1/theos/sdks/iPhoneOS11.2.sdk/System/Library/Frameworks/UIKit.framework/Headers/UIView.h:9:
While building module 'Metal' imported from /home/1/theos/sdks/iPhoneOS11.2.sdk/System/Library/Frameworks/QuartzCore.framework/Headers/CAMetalLayer.h:7:
While building module 'IOSurface' imported from /home/1/theos/sdks/iPhoneOS11.2.sdk/System/Library/Frameworks/Metal.framework/Headers/MTLTexture.h:15:
In file included from <module-includes>:1:
/home/1/theos/sdks/iPhoneOS11.2.sdk/System/Library/Frameworks/IOSurface.framework/Headers/IOSurfaceBase.h:12:10: fatal error: could not build module 'Darwin'
#include <sys/cdefs.h>
 ~~~~~~~~^
While building module 'UIKit' imported from SCLAlertView/SCLSwitchView.h:10:
While building module 'CoreImage' imported from /home/1/theos/sdks/iPhoneOS11.2.sdk/System/Library/Frameworks/UIKit.framework/Headers/UIColor.h:11:
In file included from <module-includes>:1:
In file included from /home/1/theos/sdks/iPhoneOS11.2.sdk/System/Library/Frameworks/CoreImage.framework/Headers/CoreImage.h:8:
/home/1/theos/sdks/iPhoneOS11.2.sdk/System/Library/Frameworks/CoreImage.framework/Headers/CoreImageDefines.h:10:10: fatal error: could not build module 'Darwin'
#include <TargetConditionals.h>
 ~~~~~~~~^
While building module 'UIKit' imported from SCLAlertView/SCLSwitchView.h:10:
While building module 'CoreImage' imported from /home/1/theos/sdks/iPhoneOS11.2.sdk/System/Library/Frameworks/UIKit.framework/Headers/UIColor.h:11:
While building module 'CoreVideo' imported from /home/1/theos/sdks/iPhoneOS11.2.sdk/System/Library/Frameworks/CoreImage.framework/Headers/CIImage.h:10:
In file included from <module-includes>:1:
/home/1/theos/sdks/iPhoneOS11.2.sdk/System/Library/Frameworks/CoreVideo.framework/Headers/CoreVideo.h:16:10: fatal error: could not build module 'Darwin'
#include <TargetConditionals.h>
 ~~~~~~~~^
While building module 'UIKit' imported from SCLAlertView/SCLSwitchView.h:10:
While building module 'CoreImage' imported from /home/1/theos/sdks/iPhoneOS11.2.sdk/System/Library/Frameworks/UIKit.framework/Headers/UIColor.h:11:
While building module 'ImageIO' imported from /home/1/theos/sdks/iPhoneOS11.2.sdk/System/Library/Frameworks/CoreImage.framework/Headers/CIImage.h:11:
In file included from <module-includes>:1:
In file included from /home/1/theos/sdks/iPhoneOS11.2.sdk/System/Library/Frameworks/ImageIO.framework/Headers/ImageIO.h:10:
/home/1/theos/sdks/iPhoneOS11.2.sdk/System/Library/Frameworks/ImageIO.framework/Headers/ImageIOBase.h:11:10: fatal error: could not build module 'CoreFoundation'
#include <CoreFoundation/CoreFoundation.h>
 ~~~~~~~~^
While building module 'UIKit' imported from SCLAlertView/SCLSwitchView.h:10:
While building module 'CoreText' imported from /home/1/theos/sdks/iPhoneOS11.2.sdk/System/Library/Frameworks/UIKit.framework/Headers/NSText.h:10:
In file included from <module-includes>:1:
In file included from /home/1/theos/sdks/iPhoneOS11.2.sdk/System/Library/Frameworks/CoreText.framework/Headers/CoreText.h:20:
/home/1/theos/sdks/iPhoneOS11.2.sdk/System/Library/Frameworks/CoreText.framework/Headers/CTDefines.h:12:10: fatal error: could not build module 'Darwin'
#include <Availability.h>
 ~~~~~~~~^
While building module 'UIKit' imported from SCLAlertView/SCLSwitchView.h:10:
While building module 'FileProvider' imported from /home/1/theos/sdks/iPhoneOS11.2.sdk/System/Library/Frameworks/UIKit.framework/Headers/NSFileProviderExtension.h:14:
In file included from <module-includes>:1:
In file included from /home/1/theos/sdks/iPhoneOS11.2.sdk/System/Library/Frameworks/FileProvider.framework/Headers/FileProvider.h:8:
/home/1/theos/sdks/iPhoneOS11.2.sdk/System/Library/Frameworks/FileProvider.framework/Headers/NSFileProviderDomain.h:8:9: fatal error: could not build module 'Foundation'
#import <Foundation/Foundation.h>
 ~~~~~~~^
26 errors generated.
make[3]: *** [/home/1/theos/makefiles/instance/rules.mk:197: /home/1/standoff2/.theos/obj/arm64/SCLAlertView/SCLSwitchView.m.f1450fb4.o] Error 1
==> Compiling SCLAlertView/SCLTextView.m (arm64)…
While building module 'Darwin' imported from /home/1/theos/Prefix.pch:24:
In file included from <module-includes>:72:
/home/1/theos/sdks/iPhoneOS11.2.sdk/usr/include/pthread.h:1:1: error: unknown type name 'pthread'; did you mean 'pthread_t'?
pthread/pthread.h
^
/home/1/theos/sdks/iPhoneOS11.2.sdk/usr/include/sys/_pthread/_pthread_t.h:31:28: note: 'pthread_t' declared here
typedef __darwin_pthread_t pthread_t;
                           ^
While building module 'Darwin' imported from /home/1/theos/Prefix.pch:24:
In file included from <module-includes>:72:
/home/1/theos/sdks/iPhoneOS11.2.sdk/usr/include/pthread.h:1:8: error: expected identifier or '('
pthread/pthread.h
       ^
While building module 'Darwin' imported from /home/1/theos/Prefix.pch:24:
In file included from <module-includes>:73:
/home/1/theos/sdks/iPhoneOS11.2.sdk/usr/include/pthread_impl.h:1:1: error: unknown type name 'pthread'; did you mean 'pthread_t'?
pthread/pthread_impl.h
^
/home/1/theos/sdks/iPhoneOS11.2.sdk/usr/include/sys/_pthread/_pthread_t.h:31:28: note: 'pthread_t' declared here
typedef __darwin_pthread_t pthread_t;
                           ^
While building module 'Darwin' imported from /home/1/theos/Prefix.pch:24:
In file included from <module-includes>:73:
/home/1/theos/sdks/iPhoneOS11.2.sdk/usr/include/pthread_impl.h:1:8: error: expected identifier or '('
pthread/pthread_impl.h
       ^
While building module 'Darwin' imported from /home/1/theos/Prefix.pch:24:
In file included from <module-includes>:75:
/home/1/theos/sdks/iPhoneOS11.2.sdk/usr/include/pthread_spis.h:1:1: error: unknown type name 'pthread'; did you mean 'pthread_t'?
pthread/pthread_spis.h
^
/home/1/theos/sdks/iPhoneOS11.2.sdk/usr/include/sys/_pthread/_pthread_t.h:31:28: note: 'pthread_t' declared here
typedef __darwin_pthread_t pthread_t;
                           ^
While building module 'Darwin' imported from /home/1/theos/Prefix.pch:24:
In file included from <module-includes>:75:
/home/1/theos/sdks/iPhoneOS11.2.sdk/usr/include/pthread_spis.h:1:8: error: expected identifier or '('
pthread/pthread_spis.h
       ^
While building module 'Darwin' imported from /home/1/theos/Prefix.pch:24:
In file included from <module-includes>:79:
/home/1/theos/sdks/iPhoneOS11.2.sdk/usr/include/sched.h:1:1: error: unknown type name 'pthread'; did you mean 'pthread_t'?
pthread/sched.h
^
/home/1/theos/sdks/iPhoneOS11.2.sdk/usr/include/sys/_pthread/_pthread_t.h:31:28: note: 'pthread_t' declared here
typedef __darwin_pthread_t pthread_t;
                           ^
While building module 'Darwin' imported from /home/1/theos/Prefix.pch:24:
In file included from <module-includes>:79:
/home/1/theos/sdks/iPhoneOS11.2.sdk/usr/include/sched.h:1:8: error: expected identifier or '('
pthread/sched.h
       ^
In file included from <built-in>:1:
/home/1/theos/Prefix.pch:24:12: fatal error: could not build module 'Darwin'
                        #import <TargetConditionals.h>
                         ~~~~~~~^
While building module 'UIKit' imported from SCLAlertView/SCLTextView.h:10:
In file included from <module-includes>:1:
In file included from /home/1/theos/sdks/iPhoneOS11.2.sdk/System/Library/Frameworks/UIKit.framework/Headers/UIKit.h:8:
/home/1/theos/sdks/iPhoneOS11.2.sdk/System/Library/Frameworks/UIKit.framework/Headers/UIKitDefines.h:8:9: fatal error: could not build module 'Darwin'
#import <Availability.h>
 ~~~~~~~^
While building module 'UIKit' imported from SCLAlertView/SCLTextView.h:10:
While building module 'Foundation' imported from /home/1/theos/sdks/iPhoneOS11.2.sdk/System/Library/Frameworks/UIKit.framework/Headers/UIAccelerometer.h:8:
While building module 'CoreFoundation' imported from /home/1/theos/sdks/iPhoneOS11.2.sdk/System/Library/Frameworks/Foundation.framework/Headers/Foundation.h:6:
In file included from <module-includes>:1:
/home/1/theos/sdks/iPhoneOS11.2.sdk/System/Library/Frameworks/CoreFoundation.framework/Headers/CoreFoundation.h:16:10: fatal error: could not build module 'Darwin'
#include <sys/types.h>
 ~~~~~~~~^
While building module 'UIKit' imported from SCLAlertView/SCLTextView.h:10:
While building module 'Foundation' imported from /home/1/theos/sdks/iPhoneOS11.2.sdk/System/Library/Frameworks/UIKit.framework/Headers/UIAccelerometer.h:8:
While building module 'CoreFoundation' imported from /home/1/theos/sdks/iPhoneOS11.2.sdk/System/Library/Frameworks/Foundation.framework/Headers/Foundation.h:6:
While building module 'Dispatch' imported from /home/1/theos/sdks/iPhoneOS11.2.sdk/System/Library/Frameworks/CoreFoundation.framework/Headers/CFStream.h:20:
In file included from <module-includes>:1:
/home/1/theos/sdks/iPhoneOS11.2.sdk/usr/include/dispatch/dispatch.h:25:10: fatal error: could not build module 'Darwin'
#include <Availability.h>
 ~~~~~~~~^
While building module 'UIKit' imported from SCLAlertView/SCLTextView.h:10:
While building module 'Foundation' imported from /home/1/theos/sdks/iPhoneOS11.2.sdk/System/Library/Frameworks/UIKit.framework/Headers/UIAccelerometer.h:8:
While building module 'CoreFoundation' imported from /home/1/theos/sdks/iPhoneOS11.2.sdk/System/Library/Frameworks/Foundation.framework/Headers/Foundation.h:6:
While building module 'Dispatch' imported from /home/1/theos/sdks/iPhoneOS11.2.sdk/System/Library/Frameworks/CoreFoundation.framework/Headers/CFStream.h:20:
While building module 'os_object' imported from /home/1/theos/sdks/iPhoneOS11.2.sdk/usr/include/dispatch/dispatch.h:59:
In file included from <module-includes>:1:
/home/1/theos/sdks/iPhoneOS11.2.sdk/usr/include/os/object.h:25:10: fatal error: could not build module 'Darwin'
#include <Availability.h>
 ~~~~~~~~^
While building module 'UIKit' imported from SCLAlertView/SCLTextView.h:10:
While building module 'Foundation' imported from /home/1/theos/sdks/iPhoneOS11.2.sdk/System/Library/Frameworks/UIKit.framework/Headers/UIAccelerometer.h:8:
In file included from <module-includes>:1:
/home/1/theos/sdks/iPhoneOS11.2.sdk/System/Library/Frameworks/Foundation.framework/Headers/Foundation.h:6:10: fatal error: could not build module 'CoreFoundation'
#include <CoreFoundation/CoreFoundation.h>
 ~~~~~~~~^
While building module 'UIKit' imported from SCLAlertView/SCLTextView.h:10:
While building module 'Foundation' imported from /home/1/theos/sdks/iPhoneOS11.2.sdk/System/Library/Frameworks/UIKit.framework/Headers/UIAccelerometer.h:8:
While building module 'ObjectiveC' imported from /home/1/theos/sdks/iPhoneOS11.2.sdk/System/Library/Frameworks/Foundation.framework/Headers/NSObject.h:6:
In file included from <module-includes>:1:
In file included from /home/1/theos/sdks/iPhoneOS11.2.sdk/usr/include/objc/./message.h:27:
/home/1/theos/sdks/iPhoneOS11.2.sdk/usr/include/objc/objc.h:31:10: fatal error: could not build module 'Darwin'
#include <sys/types.h>      // for __DARWIN_NULL
 ~~~~~~~~^
While building module 'UIKit' imported from SCLAlertView/SCLTextView.h:10:
While building module 'Foundation' imported from /home/1/theos/sdks/iPhoneOS11.2.sdk/System/Library/Frameworks/UIKit.framework/Headers/UIAccelerometer.h:8:
While building module 'Security' imported from /home/1/theos/sdks/iPhoneOS11.2.sdk/System/Library/Frameworks/Foundation.framework/Headers/NSURLCredential.h:9:
In file included from <module-includes>:1:
In file included from /home/1/theos/sdks/iPhoneOS11.2.sdk/System/Library/Frameworks/Security.framework/Headers/Security.h:27:
/home/1/theos/sdks/iPhoneOS11.2.sdk/System/Library/Frameworks/Security.framework/Headers/SecBase.h:27:10: fatal error: could not build module 'Darwin'
#include <TargetConditionals.h>
 ~~~~~~~~^
While building module 'UIKit' imported from SCLAlertView/SCLTextView.h:10:
While building module 'CoreGraphics' imported from /home/1/theos/sdks/iPhoneOS11.2.sdk/System/Library/Frameworks/UIKit.framework/Headers/UIAccessibility.h:9:
In file included from <module-includes>:1:
In file included from /home/1/theos/sdks/iPhoneOS11.2.sdk/System/Library/Frameworks/CoreGraphics.framework/Headers/CoreGraphics.h:8:
/home/1/theos/sdks/iPhoneOS11.2.sdk/System/Library/Frameworks/CoreGraphics.framework/Headers/CGBase.h:8:10: fatal error: could not build module 'Darwin'
#include <stdbool.h>
 ~~~~~~~~^
While building module 'UIKit' imported from SCLAlertView/SCLTextView.h:10:
While building module 'QuartzCore' imported from /home/1/theos/sdks/iPhoneOS11.2.sdk/System/Library/Frameworks/UIKit.framework/Headers/UIView.h:9:
In file included from <module-includes>:1:
In file included from /home/1/theos/sdks/iPhoneOS11.2.sdk/System/Library/Frameworks/QuartzCore.framework/Headers/QuartzCore.h:9:
In file included from /home/1/theos/sdks/iPhoneOS11.2.sdk/System/Library/Frameworks/QuartzCore.framework/Headers/CoreAnimation.h:9:
/home/1/theos/sdks/iPhoneOS11.2.sdk/System/Library/Frameworks/QuartzCore.framework/Headers/CABase.h:11:10: fatal error: could not build module 'Darwin'
#include <stdbool.h>
 ~~~~~~~~^
While building module 'UIKit' imported from SCLAlertView/SCLTextView.h:10:
While building module 'QuartzCore' imported from /home/1/theos/sdks/iPhoneOS11.2.sdk/System/Library/Frameworks/UIKit.framework/Headers/UIView.h:9:
While building module 'OpenGLES' imported from /home/1/theos/sdks/iPhoneOS11.2.sdk/System/Library/Frameworks/QuartzCore.framework/Headers/CAEAGLLayer.h:7:
In file included from <module-includes>:1:
/home/1/theos/sdks/iPhoneOS11.2.sdk/System/Library/Frameworks/OpenGLES.framework/Headers/EAGL.h:8:10: fatal error: could not build module 'Foundation'
#include <Foundation/Foundation.h>
 ~~~~~~~~^
While building module 'UIKit' imported from SCLAlertView/SCLTextView.h:10:
While building module 'QuartzCore' imported from /home/1/theos/sdks/iPhoneOS11.2.sdk/System/Library/Frameworks/UIKit.framework/Headers/UIView.h:9:
While building module 'Metal' imported from /home/1/theos/sdks/iPhoneOS11.2.sdk/System/Library/Frameworks/QuartzCore.framework/Headers/CAMetalLayer.h:7:
In file included from <module-includes>:1:
In file included from /home/1/theos/sdks/iPhoneOS11.2.sdk/System/Library/Frameworks/Metal.framework/Headers/Metal.h:8:
/home/1/theos/sdks/iPhoneOS11.2.sdk/System/Library/Frameworks/Metal.framework/Headers/MTLDefines.h:8:9: fatal error: could not build module 'Darwin'
#import <Availability.h>
 ~~~~~~~^
While building module 'UIKit' imported from SCLAlertView/SCLTextView.h:10:
While building module 'QuartzCore' imported from /home/1/theos/sdks/iPhoneOS11.2.sdk/System/Library/Frameworks/UIKit.framework/Headers/UIView.h:9:
While building module 'Metal' imported from /home/1/theos/sdks/iPhoneOS11.2.sdk/System/Library/Frameworks/QuartzCore.framework/Headers/CAMetalLayer.h:7:
While building module 'IOSurface' imported from /home/1/theos/sdks/iPhoneOS11.2.sdk/System/Library/Frameworks/Metal.framework/Headers/MTLTexture.h:15:
In file included from <module-includes>:1:
/home/1/theos/sdks/iPhoneOS11.2.sdk/System/Library/Frameworks/IOSurface.framework/Headers/IOSurfaceBase.h:12:10: fatal error: could not build module 'Darwin'
#include <sys/cdefs.h>
 ~~~~~~~~^
While building module 'UIKit' imported from SCLAlertView/SCLTextView.h:10:
While building module 'CoreImage' imported from /home/1/theos/sdks/iPhoneOS11.2.sdk/System/Library/Frameworks/UIKit.framework/Headers/UIColor.h:11:
In file included from <module-includes>:1:
In file included from /home/1/theos/sdks/iPhoneOS11.2.sdk/System/Library/Frameworks/CoreImage.framework/Headers/CoreImage.h:8:
/home/1/theos/sdks/iPhoneOS11.2.sdk/System/Library/Frameworks/CoreImage.framework/Headers/CoreImageDefines.h:10:10: fatal error: could not build module 'Darwin'
#include <TargetConditionals.h>
 ~~~~~~~~^
While building module 'UIKit' imported from SCLAlertView/SCLTextView.h:10:
While building module 'CoreImage' imported from /home/1/theos/sdks/iPhoneOS11.2.sdk/System/Library/Frameworks/UIKit.framework/Headers/UIColor.h:11:
While building module 'CoreVideo' imported from /home/1/theos/sdks/iPhoneOS11.2.sdk/System/Library/Frameworks/CoreImage.framework/Headers/CIImage.h:10:
In file included from <module-includes>:1:
/home/1/theos/sdks/iPhoneOS11.2.sdk/System/Library/Frameworks/CoreVideo.framework/Headers/CoreVideo.h:16:10: fatal error: could not build module 'Darwin'
#include <TargetConditionals.h>
 ~~~~~~~~^
While building module 'UIKit' imported from SCLAlertView/SCLTextView.h:10:
While building module 'CoreImage' imported from /home/1/theos/sdks/iPhoneOS11.2.sdk/System/Library/Frameworks/UIKit.framework/Headers/UIColor.h:11:
While building module 'ImageIO' imported from /home/1/theos/sdks/iPhoneOS11.2.sdk/System/Library/Frameworks/CoreImage.framework/Headers/CIImage.h:11:
In file included from <module-includes>:1:
In file included from /home/1/theos/sdks/iPhoneOS11.2.sdk/System/Library/Frameworks/ImageIO.framework/Headers/ImageIO.h:10:
/home/1/theos/sdks/iPhoneOS11.2.sdk/System/Library/Frameworks/ImageIO.framework/Headers/ImageIOBase.h:11:10: fatal error: could not build module 'CoreFoundation'
#include <CoreFoundation/CoreFoundation.h>
 ~~~~~~~~^
While building module 'UIKit' imported from SCLAlertView/SCLTextView.h:10:
While building module 'CoreText' imported from /home/1/theos/sdks/iPhoneOS11.2.sdk/System/Library/Frameworks/UIKit.framework/Headers/NSText.h:10:
In file included from <module-includes>:1:
In file included from /home/1/theos/sdks/iPhoneOS11.2.sdk/System/Library/Frameworks/CoreText.framework/Headers/CoreText.h:20:
/home/1/theos/sdks/iPhoneOS11.2.sdk/System/Library/Frameworks/CoreText.framework/Headers/CTDefines.h:12:10: fatal error: could not build module 'Darwin'
#include <Availability.h>
 ~~~~~~~~^
While building module 'UIKit' imported from SCLAlertView/SCLTextView.h:10:
While building module 'FileProvider' imported from /home/1/theos/sdks/iPhoneOS11.2.sdk/System/Library/Frameworks/UIKit.framework/Headers/NSFileProviderExtension.h:14:
In file included from <module-includes>:1:
In file included from /home/1/theos/sdks/iPhoneOS11.2.sdk/System/Library/Frameworks/FileProvider.framework/Headers/FileProvider.h:8:
/home/1/theos/sdks/iPhoneOS11.2.sdk/System/Library/Frameworks/FileProvider.framework/Headers/NSFileProviderDomain.h:8:9: fatal error: could not build module 'Foundation'
#import <Foundation/Foundation.h>
 ~~~~~~~^
26 errors generated.
make[3]: *** [/home/1/theos/makefiles/instance/rules.mk:197: /home/1/standoff2/.theos/obj/arm64/SCLAlertView/SCLTextView.m.f1450fb4.o] Error 1
==> Compiling SCLAlertView/SCLButton.m (arm64)…
While building module 'Darwin' imported from /home/1/theos/Prefix.pch:24:
In file included from <module-includes>:72:
/home/1/theos/sdks/iPhoneOS11.2.sdk/usr/include/pthread.h:1:1: error: unknown type name 'pthread'; did you mean 'pthread_t'?
pthread/pthread.h
^
/home/1/theos/sdks/iPhoneOS11.2.sdk/usr/include/sys/_pthread/_pthread_t.h:31:28: note: 'pthread_t' declared here
typedef __darwin_pthread_t pthread_t;
                           ^
While building module 'Darwin' imported from /home/1/theos/Prefix.pch:24:
In file included from <module-includes>:72:
/home/1/theos/sdks/iPhoneOS11.2.sdk/usr/include/pthread.h:1:8: error: expected identifier or '('
pthread/pthread.h
       ^
While building module 'Darwin' imported from /home/1/theos/Prefix.pch:24:
In file included from <module-includes>:73:
/home/1/theos/sdks/iPhoneOS11.2.sdk/usr/include/pthread_impl.h:1:1: error: unknown type name 'pthread'; did you mean 'pthread_t'?
pthread/pthread_impl.h
^
/home/1/theos/sdks/iPhoneOS11.2.sdk/usr/include/sys/_pthread/_pthread_t.h:31:28: note: 'pthread_t' declared here
typedef __darwin_pthread_t pthread_t;
                           ^
While building module 'Darwin' imported from /home/1/theos/Prefix.pch:24:
In file included from <module-includes>:73:
/home/1/theos/sdks/iPhoneOS11.2.sdk/usr/include/pthread_impl.h:1:8: error: expected identifier or '('
pthread/pthread_impl.h
       ^
While building module 'Darwin' imported from /home/1/theos/Prefix.pch:24:
In file included from <module-includes>:75:
/home/1/theos/sdks/iPhoneOS11.2.sdk/usr/include/pthread_spis.h:1:1: error: unknown type name 'pthread'; did you mean 'pthread_t'?
pthread/pthread_spis.h
^
/home/1/theos/sdks/iPhoneOS11.2.sdk/usr/include/sys/_pthread/_pthread_t.h:31:28: note: 'pthread_t' declared here
typedef __darwin_pthread_t pthread_t;
                           ^
While building module 'Darwin' imported from /home/1/theos/Prefix.pch:24:
In file included from <module-includes>:75:
/home/1/theos/sdks/iPhoneOS11.2.sdk/usr/include/pthread_spis.h:1:8: error: expected identifier or '('
pthread/pthread_spis.h
       ^
While building module 'Darwin' imported from /home/1/theos/Prefix.pch:24:
In file included from <module-includes>:79:
/home/1/theos/sdks/iPhoneOS11.2.sdk/usr/include/sched.h:1:1: error: unknown type name 'pthread'; did you mean 'pthread_t'?
pthread/sched.h
^
/home/1/theos/sdks/iPhoneOS11.2.sdk/usr/include/sys/_pthread/_pthread_t.h:31:28: note: 'pthread_t' declared here
typedef __darwin_pthread_t pthread_t;
                           ^
While building module 'Darwin' imported from /home/1/theos/Prefix.pch:24:
In file included from <module-includes>:79:
/home/1/theos/sdks/iPhoneOS11.2.sdk/usr/include/sched.h:1:8: error: expected identifier or '('
pthread/sched.h
       ^
In file included from <built-in>:1:
/home/1/theos/Prefix.pch:24:12: fatal error: could not build module 'Darwin'
                        #import <TargetConditionals.h>
                         ~~~~~~~^
While building module 'UIKit' imported from SCLAlertView/SCLButton.h:10:
In file included from <module-includes>:1:
In file included from /home/1/theos/sdks/iPhoneOS11.2.sdk/System/Library/Frameworks/UIKit.framework/Headers/UIKit.h:8:
/home/1/theos/sdks/iPhoneOS11.2.sdk/System/Library/Frameworks/UIKit.framework/Headers/UIKitDefines.h:8:9: fatal error: could not build module 'Darwin'
#import <Availability.h>
 ~~~~~~~^
While building module 'UIKit' imported from SCLAlertView/SCLButton.h:10:
While building module 'Foundation' imported from /home/1/theos/sdks/iPhoneOS11.2.sdk/System/Library/Frameworks/UIKit.framework/Headers/UIAccelerometer.h:8:
While building module 'CoreFoundation' imported from /home/1/theos/sdks/iPhoneOS11.2.sdk/System/Library/Frameworks/Foundation.framework/Headers/Foundation.h:6:
In file included from <module-includes>:1:
/home/1/theos/sdks/iPhoneOS11.2.sdk/System/Library/Frameworks/CoreFoundation.framework/Headers/CoreFoundation.h:16:10: fatal error: could not build module 'Darwin'
#include <sys/types.h>
 ~~~~~~~~^
While building module 'UIKit' imported from SCLAlertView/SCLButton.h:10:
While building module 'Foundation' imported from /home/1/theos/sdks/iPhoneOS11.2.sdk/System/Library/Frameworks/UIKit.framework/Headers/UIAccelerometer.h:8:
While building module 'CoreFoundation' imported from /home/1/theos/sdks/iPhoneOS11.2.sdk/System/Library/Frameworks/Foundation.framework/Headers/Foundation.h:6:
While building module 'Dispatch' imported from /home/1/theos/sdks/iPhoneOS11.2.sdk/System/Library/Frameworks/CoreFoundation.framework/Headers/CFStream.h:20:
In file included from <module-includes>:1:
/home/1/theos/sdks/iPhoneOS11.2.sdk/usr/include/dispatch/dispatch.h:25:10: fatal error: could not build module 'Darwin'
#include <Availability.h>
 ~~~~~~~~^
While building module 'UIKit' imported from SCLAlertView/SCLButton.h:10:
While building module 'Foundation' imported from /home/1/theos/sdks/iPhoneOS11.2.sdk/System/Library/Frameworks/UIKit.framework/Headers/UIAccelerometer.h:8:
While building module 'CoreFoundation' imported from /home/1/theos/sdks/iPhoneOS11.2.sdk/System/Library/Frameworks/Foundation.framework/Headers/Foundation.h:6:
While building module 'Dispatch' imported from /home/1/theos/sdks/iPhoneOS11.2.sdk/System/Library/Frameworks/CoreFoundation.framework/Headers/CFStream.h:20:
While building module 'os_object' imported from /home/1/theos/sdks/iPhoneOS11.2.sdk/usr/include/dispatch/dispatch.h:59:
In file included from <module-includes>:1:
/home/1/theos/sdks/iPhoneOS11.2.sdk/usr/include/os/object.h:25:10: fatal error: could not build module 'Darwin'
#include <Availability.h>
 ~~~~~~~~^
While building module 'UIKit' imported from SCLAlertView/SCLButton.h:10:
While building module 'Foundation' imported from /home/1/theos/sdks/iPhoneOS11.2.sdk/System/Library/Frameworks/UIKit.framework/Headers/UIAccelerometer.h:8:
In file included from <module-includes>:1:
/home/1/theos/sdks/iPhoneOS11.2.sdk/System/Library/Frameworks/Foundation.framework/Headers/Foundation.h:6:10: fatal error: could not build module 'CoreFoundation'
#include <CoreFoundation/CoreFoundation.h>
 ~~~~~~~~^
While building module 'UIKit' imported from SCLAlertView/SCLButton.h:10:
While building module 'Foundation' imported from /home/1/theos/sdks/iPhoneOS11.2.sdk/System/Library/Frameworks/UIKit.framework/Headers/UIAccelerometer.h:8:
While building module 'ObjectiveC' imported from /home/1/theos/sdks/iPhoneOS11.2.sdk/System/Library/Frameworks/Foundation.framework/Headers/NSObject.h:6:
In file included from <module-includes>:1:
In file included from /home/1/theos/sdks/iPhoneOS11.2.sdk/usr/include/objc/./message.h:27:
/home/1/theos/sdks/iPhoneOS11.2.sdk/usr/include/objc/objc.h:31:10: fatal error: could not build module 'Darwin'
#include <sys/types.h>      // for __DARWIN_NULL
 ~~~~~~~~^
While building module 'UIKit' imported from SCLAlertView/SCLButton.h:10:
While building module 'Foundation' imported from /home/1/theos/sdks/iPhoneOS11.2.sdk/System/Library/Frameworks/UIKit.framework/Headers/UIAccelerometer.h:8:
While building module 'Security' imported from /home/1/theos/sdks/iPhoneOS11.2.sdk/System/Library/Frameworks/Foundation.framework/Headers/NSURLCredential.h:9:
In file included from <module-includes>:1:
In file included from /home/1/theos/sdks/iPhoneOS11.2.sdk/System/Library/Frameworks/Security.framework/Headers/Security.h:27:
/home/1/theos/sdks/iPhoneOS11.2.sdk/System/Library/Frameworks/Security.framework/Headers/SecBase.h:27:10: fatal error: could not build module 'Darwin'
#include <TargetConditionals.h>
 ~~~~~~~~^
While building module 'UIKit' imported from SCLAlertView/SCLButton.h:10:
While building module 'CoreGraphics' imported from /home/1/theos/sdks/iPhoneOS11.2.sdk/System/Library/Frameworks/UIKit.framework/Headers/UIAccessibility.h:9:
In file included from <module-includes>:1:
In file included from /home/1/theos/sdks/iPhoneOS11.2.sdk/System/Library/Frameworks/CoreGraphics.framework/Headers/CoreGraphics.h:8:
/home/1/theos/sdks/iPhoneOS11.2.sdk/System/Library/Frameworks/CoreGraphics.framework/Headers/CGBase.h:8:10: fatal error: could not build module 'Darwin'
#include <stdbool.h>
 ~~~~~~~~^
While building module 'UIKit' imported from SCLAlertView/SCLButton.h:10:
While building module 'QuartzCore' imported from /home/1/theos/sdks/iPhoneOS11.2.sdk/System/Library/Frameworks/UIKit.framework/Headers/UIView.h:9:
In file included from <module-includes>:1:
In file included from /home/1/theos/sdks/iPhoneOS11.2.sdk/System/Library/Frameworks/QuartzCore.framework/Headers/QuartzCore.h:9:
In file included from /home/1/theos/sdks/iPhoneOS11.2.sdk/System/Library/Frameworks/QuartzCore.framework/Headers/CoreAnimation.h:9:
/home/1/theos/sdks/iPhoneOS11.2.sdk/System/Library/Frameworks/QuartzCore.framework/Headers/CABase.h:11:10: fatal error: could not build module 'Darwin'
#include <stdbool.h>
 ~~~~~~~~^
While building module 'UIKit' imported from SCLAlertView/SCLButton.h:10:
While building module 'QuartzCore' imported from /home/1/theos/sdks/iPhoneOS11.2.sdk/System/Library/Frameworks/UIKit.framework/Headers/UIView.h:9:
While building module 'OpenGLES' imported from /home/1/theos/sdks/iPhoneOS11.2.sdk/System/Library/Frameworks/QuartzCore.framework/Headers/CAEAGLLayer.h:7:
In file included from <module-includes>:1:
/home/1/theos/sdks/iPhoneOS11.2.sdk/System/Library/Frameworks/OpenGLES.framework/Headers/EAGL.h:8:10: fatal error: could not build module 'Foundation'
#include <Foundation/Foundation.h>
 ~~~~~~~~^
While building module 'UIKit' imported from SCLAlertView/SCLButton.h:10:
While building module 'QuartzCore' imported from /home/1/theos/sdks/iPhoneOS11.2.sdk/System/Library/Frameworks/UIKit.framework/Headers/UIView.h:9:
While building module 'Metal' imported from /home/1/theos/sdks/iPhoneOS11.2.sdk/System/Library/Frameworks/QuartzCore.framework/Headers/CAMetalLayer.h:7:
In file included from <module-includes>:1:
In file included from /home/1/theos/sdks/iPhoneOS11.2.sdk/System/Library/Frameworks/Metal.framework/Headers/Metal.h:8:
/home/1/theos/sdks/iPhoneOS11.2.sdk/System/Library/Frameworks/Metal.framework/Headers/MTLDefines.h:8:9: fatal error: could not build module 'Darwin'
#import <Availability.h>
 ~~~~~~~^
While building module 'UIKit' imported from SCLAlertView/SCLButton.h:10:
While building module 'QuartzCore' imported from /home/1/theos/sdks/iPhoneOS11.2.sdk/System/Library/Frameworks/UIKit.framework/Headers/UIView.h:9:
While building module 'Metal' imported from /home/1/theos/sdks/iPhoneOS11.2.sdk/System/Library/Frameworks/QuartzCore.framework/Headers/CAMetalLayer.h:7:
While building module 'IOSurface' imported from /home/1/theos/sdks/iPhoneOS11.2.sdk/System/Library/Frameworks/Metal.framework/Headers/MTLTexture.h:15:
In file included from <module-includes>:1:
/home/1/theos/sdks/iPhoneOS11.2.sdk/System/Library/Frameworks/IOSurface.framework/Headers/IOSurfaceBase.h:12:10: fatal error: could not build module 'Darwin'
#include <sys/cdefs.h>
 ~~~~~~~~^
While building module 'UIKit' imported from SCLAlertView/SCLButton.h:10:
While building module 'CoreImage' imported from /home/1/theos/sdks/iPhoneOS11.2.sdk/System/Library/Frameworks/UIKit.framework/Headers/UIColor.h:11:
In file included from <module-includes>:1:
In file included from /home/1/theos/sdks/iPhoneOS11.2.sdk/System/Library/Frameworks/CoreImage.framework/Headers/CoreImage.h:8:
/home/1/theos/sdks/iPhoneOS11.2.sdk/System/Library/Frameworks/CoreImage.framework/Headers/CoreImageDefines.h:10:10: fatal error: could not build module 'Darwin'
#include <TargetConditionals.h>
 ~~~~~~~~^
While building module 'UIKit' imported from SCLAlertView/SCLButton.h:10:
While building module 'CoreImage' imported from /home/1/theos/sdks/iPhoneOS11.2.sdk/System/Library/Frameworks/UIKit.framework/Headers/UIColor.h:11:
While building module 'CoreVideo' imported from /home/1/theos/sdks/iPhoneOS11.2.sdk/System/Library/Frameworks/CoreImage.framework/Headers/CIImage.h:10:
In file included from <module-includes>:1:
/home/1/theos/sdks/iPhoneOS11.2.sdk/System/Library/Frameworks/CoreVideo.framework/Headers/CoreVideo.h:16:10: fatal error: could not build module 'Darwin'
#include <TargetConditionals.h>
 ~~~~~~~~^
While building module 'UIKit' imported from SCLAlertView/SCLButton.h:10:
While building module 'CoreImage' imported from /home/1/theos/sdks/iPhoneOS11.2.sdk/System/Library/Frameworks/UIKit.framework/Headers/UIColor.h:11:
While building module 'ImageIO' imported from /home/1/theos/sdks/iPhoneOS11.2.sdk/System/Library/Frameworks/CoreImage.framework/Headers/CIImage.h:11:
In file included from <module-includes>:1:
In file included from /home/1/theos/sdks/iPhoneOS11.2.sdk/System/Library/Frameworks/ImageIO.framework/Headers/ImageIO.h:10:
/home/1/theos/sdks/iPhoneOS11.2.sdk/System/Library/Frameworks/ImageIO.framework/Headers/ImageIOBase.h:11:10: fatal error: could not build module 'CoreFoundation'
#include <CoreFoundation/CoreFoundation.h>
 ~~~~~~~~^
While building module 'UIKit' imported from SCLAlertView/SCLButton.h:10:
While building module 'CoreText' imported from /home/1/theos/sdks/iPhoneOS11.2.sdk/System/Library/Frameworks/UIKit.framework/Headers/NSText.h:10:
In file included from <module-includes>:1:
In file included from /home/1/theos/sdks/iPhoneOS11.2.sdk/System/Library/Frameworks/CoreText.framework/Headers/CoreText.h:20:
/home/1/theos/sdks/iPhoneOS11.2.sdk/System/Library/Frameworks/CoreText.framework/Headers/CTDefines.h:12:10: fatal error: could not build module 'Darwin'
#include <Availability.h>
 ~~~~~~~~^
While building module 'UIKit' imported from SCLAlertView/SCLButton.h:10:
While building module 'FileProvider' imported from /home/1/theos/sdks/iPhoneOS11.2.sdk/System/Library/Frameworks/UIKit.framework/Headers/NSFileProviderExtension.h:14:
In file included from <module-includes>:1:
In file included from /home/1/theos/sdks/iPhoneOS11.2.sdk/System/Library/Frameworks/FileProvider.framework/Headers/FileProvider.h:8:
/home/1/theos/sdks/iPhoneOS11.2.sdk/System/Library/Frameworks/FileProvider.framework/Headers/NSFileProviderDomain.h:8:9: fatal error: could not build module 'Foundation'
#import <Foundation/Foundation.h>
 ~~~~~~~^
26 errors generated.
make[3]: *** [/home/1/theos/makefiles/instance/rules.mk:197: /home/1/standoff2/.theos/obj/arm64/SCLAlertView/SCLButton.m.f1450fb4.o] Error 1
rm /home/1/standoff2/.theos/obj/arm64/Tweak.xm.mm
make[2]: *** [/home/1/theos/makefiles/instance/library.mk:52: /home/1/standoff2/.theos/obj/arm64/Standoff2.dylib] Error 2
make[1]: *** [/home/1/theos/makefiles/instance/library.mk:37: internal-library-all_] Error 2
make: *** [/home/1/theos/makefiles/master/rules.mk:119: Standoff2.all.tweak.variables] Error 2
 

Create an account or sign in to comment

You need to be a member in order to leave a comment

Create an account

Sign up for a new account in our community. It's easy!

Register a new account

Sign in

Already have an account? Sign in here.

Sign In Now
  • Our picks

    • The Posthumous Investigation +1 Jailed Cheat [ Full Game Unlocked ]
      Modded/Hacked App: The Posthumous Investigation By Mother Gaia Studio
      Bundle ID: br.com.mothergaia.theposthumousinvestigation
      App Store Link: https://apps.apple.com/us/app/the-posthumous-investigation/id1614001053?uo=4

       


      🤩 Hack Features

      -- Full Game Unlocked
      • 0 replies
    • The Traitors: Interactive Game +3 Jailed Cheats [ Unlimited Currencies ]
      Modded/Hacked App: The Traitors: Interactive Game By Fusebox Games Ltd
      Bundle ID: com.fuseboxgames.traitors
      App Store Link: https://apps.apple.com/us/app/the-traitors-interactive-game/id6751324795?uo=4

       

      🤩 Hack Features

      - Unlimited Gems
      - Unlimited Tickets
      -- No Forced Ads
      • 1 reply
    • 機動戦士ガンダム U.C. ENGAGE +2 Cheats
      Mod APK Game Name: 機動戦士ガンダム U.C. ENGAGE By Bandai Namco Entertainment Inc.
      Rooted Device: Not Required.
      Google Play Store Link: https://play.google.com/store/apps/details?id=com.bandainamcoent.gundamucengage

       

      🤩 Hack Features

      - Damage Multiplier
      - Defense Multiplier

       

      ⬇️ Android Mod APK Download Link


      Hidden Content

      Download via the iOSGods App for Android







       

      📖 Android Installation Instructions

      STEP 1: Download the modded APK file from the link above using your preferred Android browser or download manager.
      STEP 2: Once the download is complete, open your file manager and locate the downloaded .apk file (usually in the Downloads folder).
      STEP 3: Tap the APK file, then select Install. If prompted, enable Install from Unknown Sources in your device settings.
      STEP 3A: If the mod includes an OBB file, extract it if it’s inside an archive. Then move the folder to: /Android/obb/
      STEP 3B: If the mod includes a DATA file, extract it if it’s archived. Then move the folder to: /Android/data/
      STEP 4: Once installed, open the game and toggle your desired cheats & features through the APK mod menu. Enjoy!

       

      NOTE: If you have any questions or issues, read our Frequently Asked Questions topic. If you still need help, post your issue below and we’ll assist you as soon as possible. If the mod works for you, please share your feedback to help other members!

       

      🙌 Credits

      - AlyssaX64

       

      📷 Cheat Video/Screenshots

      N/A

       

       iOS & iPadOS App Hacks
      If you’re looking for Non-Jailbroken & No Jailbreak required iOS IPA hacks, visit the iOS Game Cheats & Hacks or the iOSGods App for a variety of modded games and apps for non-jailbroken iOS devices.
      • 7 replies
    • Raft® Survival - Ocean Nomad +18 Jailed Cheats
      Modded/Hacked App: Raft® Survival - Ocean Nomad By Survival Games Ltd
      Bundle ID: com.raftsurvival.raft
      App Store Link: https://apps.apple.com/us/app/raft-survival-ocean-nomad/id1326046015?uo=4

       

       

      📌 Mod Requirements

      - Non-Jailbroken/Jailed or Jailbroken iPhone or iPad.
      - Sideloadly or alternatives.
      - Computer running Windows/macOS/Linux with iTunes installed.

       

      🤩 Hack Features

      - Unlimited Currenices
      - Never Die
      - No Thirst/Hunger
      - Craft Anything
      - One Hit Kill - Shark
      - No Shark Spawn
      - Unlimited Durability

       

      ⬇️ iOS Hack Download IPA Link


      Hidden Content

      Download via the iOSGods App







       

      📖 PC Installation Instructions

      STEP 1: Download the pre-hacked .IPA file from the link above to your computer. To download from the iOSGods App, see our iOSGods App IPA Download Tutorial which includes a video example.
      STEP 2: Download Sideloadly and install it on your Windows or Mac.
      STEP 3: Open Sideloadly on your computer, connect your iOS device, and wait until your device name appears in Sideloadly.
      STEP 4: Once your iDevice is recognized, drag the modded .IPA file you downloaded and drop it into the Sideloadly application.
      STEP 5: Enter your Apple Account email, then press “Start.” You’ll then be asked to enter your password. Go ahead and provide the required information.
      STEP 6: Wait for Sideloadly to finish sideloading/installing the hacked IPA. If there are issues during installation, please read the note below.
      STEP 7: Once the installation is complete and you see the app on your Home Screen, you will need to go to Settings -> General -> Profiles / VPN & Device Management. Once there, tap on the email you entered from step 6, and then tap on 'Trust [email protected]'.
      STEP 8: Now go to your Home Screen and open the newly installed app and everything should work fine. You may need to follow further per app instructions inside the hack's popup in-game.

      NOTE: iOS/iPadOS 16 and later, you must enable Developer Mode. For free Apple Developer accounts, you will need to repeat this process every 7 days. If you have any questions or problems, read our Sideloadly FAQ section of the topic and if you don't find a solution, please post your issue below and we'll do our best to help! If the hack does work for you, post your feedback below and help out other fellow members that are encountering issues.

       

      🙌 Credits

      - AlyssaX64

       

      📷 Cheat Video/Screenshots

      N/A
      • 89 replies
    • Dark Hunter - Hunter Hero RPG +5 Cheats
      Mod APK Game Name: Dark Hunter - Hunter Hero RPG By Dovi Games
      Rooted Device: Not Required.
      Google Play Store Link: https://play.google.com/store/apps/details?id=dovi.darkhero.survival

       

      🤩 Hack Features

      - Damage Multiplier
      - Defense Multiplier
      - Diamond Increase On Spend
      - Move Speed Multiplier
      - No ADS

       

      ⬇️ Android Mod APK Download Link


      Hidden Content

      Download via the iOSGods App for Android







       

      📖 Android Installation Instructions

      STEP 1: Download the modded APK file from the link above using your preferred Android browser or download manager.
      STEP 2: Once the download is complete, open your file manager and locate the downloaded .apk file (usually in the Downloads folder).
      STEP 3: Tap the APK file, then select Install. If prompted, enable Install from Unknown Sources in your device settings.
      STEP 3A: If the mod includes an OBB file, extract it if it’s inside an archive. Then move the folder to: /Android/obb/
      STEP 3B: If the mod includes a DATA file, extract it if it’s archived. Then move the folder to: /Android/data/
      STEP 4: Once installed, open the game and toggle your desired cheats & features through the APK mod menu. Enjoy!

       

      NOTE: If you have any questions or issues, read our Frequently Asked Questions topic. If you still need help, post your issue below and we’ll assist you as soon as possible. If the mod works for you, please share your feedback to help other members!

       

      🙌 Credits

      - AlyssaX64

       

      📷 Cheat Video/Screenshots

      N/A

       

       iOS & iPadOS App Hacks
      If you’re looking for Non-Jailbroken & No Jailbreak required iOS IPA hacks, visit the iOS Game Cheats & Hacks or the iOSGods App for a variety of modded games and apps for non-jailbroken iOS devices.
      • 12 replies
    • Hololive Dreams JP / ホロライブドリームス +3 Jailed Cheats
      Modded/Hacked App: ホロライブドリームス By QualiArts, Inc.
      Bundle ID: game.qualiarts.hololive.dreams.jp
      App Store Link: https://apps.apple.com/jp/app/%E3%83%9B%E3%83%AD%E3%83%A9%E3%82%A4%E3%83%96%E3%83%89%E3%83%AA%E3%83%BC%E3%83%A0%E3%82%B9/id6756641135?uo=4

       

      📌 Mod Requirements

      - Non-Jailbroken/Jailed or Jailbroken iPhone or iPad.
      - Sideloadly or alternatives.
      - Computer running Windows/macOS/Linux with iTunes installed.

       

      🤩 Hack Features

      - Unlimited Jump
      - Freeze HP
      - Always Perfect

       

      ⬇️ iOS Hack Download IPA Link


      Hidden Content

      Download via the iOSGods App







       

      📖 PC Installation Instructions

      STEP 1: Download the pre-hacked .IPA file from the link above to your computer. To download from the iOSGods App, see our iOSGods App IPA Download Tutorial which includes a video example.
      STEP 2: Download Sideloadly and install it on your Windows or Mac.
      STEP 3: Open Sideloadly on your computer, connect your iOS device, and wait until your device name appears in Sideloadly.
      STEP 4: Once your iDevice is recognized, drag the modded .IPA file you downloaded and drop it into the Sideloadly application.
      STEP 5: Enter your Apple Account email, then press “Start.” You’ll then be asked to enter your password. Go ahead and provide the required information.
      STEP 6: Wait for Sideloadly to finish sideloading/installing the hacked IPA. If there are issues during installation, please read the note below.
      STEP 7: Once the installation is complete and you see the app on your Home Screen, you will need to go to Settings -> General -> Profiles / VPN & Device Management. Once there, tap on the email you entered from step 6, and then tap on 'Trust [email protected]'.
      STEP 8: Now go to your Home Screen and open the newly installed app and everything should work fine. You may need to follow further per app instructions inside the hack's popup in-game.

      NOTE: iOS/iPadOS 16 and later, you must enable Developer Mode. For free Apple Developer accounts, you will need to repeat this process every 7 days. If you have any questions or problems, read our Sideloadly FAQ section of the topic and if you don't find a solution, please post your issue below and we'll do our best to help! If the hack does work for you, post your feedback below and help out other fellow members that are encountering issues.

       

      🙌 Credits

      - AlyssaX64

       

      📷 Cheat Video/Screenshots

      N/A
      • 13 replies
    • EGGRYPTO: Hatch! Own! Monster +2 Cheats
      Mod APK Game Name: EGGRYPTO: Hatch! Own! Monster By Kyuzan Inc.
      Rooted Device: Not Required.
      Google Play Store Link: https://play.google.com/store/apps/details?id=com.KyuzanInc.Eggrypt

       

      🤩 Hack Features

      - Damage Multiplier
      - Defense Multiplier

       

      ⬇️ Android Mod APK Download Link


      Hidden Content

      Download via the iOSGods App for Android







       

      📖 Android Installation Instructions

      STEP 1: Download the modded APK file from the link above using your preferred Android browser or download manager.
      STEP 2: Once the download is complete, open your file manager and locate the downloaded .apk file (usually in the Downloads folder).
      STEP 3: Tap the APK file, then select Install. If prompted, enable Install from Unknown Sources in your device settings.
      STEP 3A: If the mod includes an OBB file, extract it if it’s inside an archive. Then move the folder to: /Android/obb/
      STEP 3B: If the mod includes a DATA file, extract it if it’s archived. Then move the folder to: /Android/data/
      STEP 4: Once installed, open the game and toggle your desired cheats & features through the APK mod menu. Enjoy!

       

      NOTE: If you have any questions or issues, read our Frequently Asked Questions topic. If you still need help, post your issue below and we’ll assist you as soon as possible. If the mod works for you, please share your feedback to help other members!

       

      🙌 Credits

      - AlyssaX64

       

      📷 Cheat Video/Screenshots

      N/A

       

       iOS & iPadOS App Hacks
      If you’re looking for Non-Jailbroken & No Jailbreak required iOS IPA hacks, visit the iOS Game Cheats & Hacks or the iOSGods App for a variety of modded games and apps for non-jailbroken iOS devices.
      • 16 replies
    • Idle Bank Tycoon: Money Game +1 Jailed Cheat
      Modded/Hacked App: Idle Bank Tycoon: Money Game By Kolibri Games GmbH
      Bundle ID: com.luckyskeletonstudios.idlebanktycoon
      iTunes Store Link: https://apps.apple.com/us/app/idle-bank-tycoon-money-game/id1645281275?uo=4


      Mod Requirements:
      - Non-Jailbroken/Jailed or Jailbroken iPhone/iPad/iPod Touch.
      - Sideloadly / Cydia Impactor or alternatives.
      - A Computer Running Windows/macOS/Linux with iTunes installed.


      Hack Features:
      - Freeze Currencies


      Jailbreak required hack(s): 


      iOS Hack Download IPA Link:

      Hidden Content

      Download via the iOSGods App








      PC Installation Instructions:
      STEP 1: If necessary, uninstall the app if you have it installed on your iDevice. Some hacked IPAs will install as a duplicate app. Make sure to back it up so you don't lose your progress.
      STEP 2: Download the pre-hacked .IPA file from the link above to your computer. To download from the iOSGods App, see this tutorial topic.
      STEP 3: Download Sideloadly and install it on your PC.
      STEP 4: Open/Run Sideloadly on your computer, connect your iOS Device, and wait until your device name shows up.
      STEP 5: Once your iDevice appears, drag the modded .IPA file you downloaded and drop it inside the Sideloadly application.
      STEP 6: You will now have to enter your iTunes/Apple ID email login, press "Start" & then you will be asked to enter your password. Go ahead and enter the required information.
      STEP 7: Wait for Sideloadly to finish sideloading/installing the hacked IPA. If there are issues during installation, please read the note below.
      STEP 8: Once the installation is complete and you see the app on your Home Screen, you will need to go to Settings -> General -> Profiles/VPN & Device Management. Once there, tap on the email you entered from step 6, and then tap on 'Trust [email protected]'.
      STEP 9: Now go to your Home Screen and open the newly installed app and everything should work fine. You may need to follow further per app instructions inside the hack's popup in-game.

      NOTE: iOS/iPadOS 16 and later, you must enable Developer Mode. For free Apple Developer accounts, you will need to repeat this process every 7 days. Jailbroken iDevices can also use Sideloadly/Filza/IPA Installer to normally install the IPA with AppSync. If you have any questions or problems, read our Sideloadly FAQ section of the topic and if you don't find a solution, please post your issue down below and we'll do our best to help! If the hack does work for you, post your feedback below and help out other fellow members that are encountering issues.


      Credits:
      - AlyssaX64


      Cheat Video/Screenshots:

      N/A
      • 235 replies
    • BLUE LOCK PWC +2 Jailed Cheats
      Modded/Hacked App: BLUE LOCK PWC By Rudel inc.
      Bundle ID: jp.pjfbgl
      iTunes Store Link: https://apps.apple.com/us/app/blue-lock-pwc/id6476623870?uo=4


      Mod Requirements:
      - Non-Jailbroken/Jailed or Jailbroken iPhone/iPad/iPod Touch.
      - Sideloadly / Cydia Impactor or alternatives.
      - A Computer Running Windows/macOS/Linux with iTunes installed.


      Hack Features:
      - Player Stats Multiplier
      - Enemy Stats Divider


      Jailbreak required hack(s): 


      iOS Hack Download IPA Link:

      Hidden Content

      Download via the iOSGods App








      PC Installation Instructions:
      STEP 1: If necessary, uninstall the app if you have it installed on your iDevice. Some hacked IPAs will install as a duplicate app. Make sure to back it up so you don't lose your progress.
      STEP 2: Download the pre-hacked .IPA file from the link above to your computer. To download from the iOSGods App, see this tutorial topic.
      STEP 3: Download Sideloadly and install it on your PC.
      STEP 4: Open/Run Sideloadly on your computer, connect your iOS Device, and wait until your device name shows up.
      STEP 5: Once your iDevice appears, drag the modded .IPA file you downloaded and drop it inside the Sideloadly application.
      STEP 6: You will now have to enter your iTunes/Apple ID email login, press "Start" & then you will be asked to enter your password. Go ahead and enter the required information.
      STEP 7: Wait for Sideloadly to finish sideloading/installing the hacked IPA. If there are issues during installation, please read the note below.
      STEP 8: Once the installation is complete and you see the app on your Home Screen, you will need to go to Settings -> General -> Profiles/VPN & Device Management. Once there, tap on the email you entered from step 6, and then tap on 'Trust [email protected]'.
      STEP 9: Now go to your Home Screen and open the newly installed app and everything should work fine. You may need to follow further per app instructions inside the hack's popup in-game.

      NOTE: iOS/iPadOS 16 and later, you must enable Developer Mode. For free Apple Developer accounts, you will need to repeat this process every 7 days. Jailbroken iDevices can also use Sideloadly/Filza/IPA Installer to normally install the IPA with AppSync. If you have any questions or problems, read our Sideloadly FAQ section of the topic and if you don't find a solution, please post your issue down below and we'll do our best to help! If the hack does work for you, post your feedback below and help out other fellow members that are encountering issues.


      Credits:
      - AlyssaX64


      Cheat Video/Screenshots:

      N/A
      • 75 replies
    • Guidus One +4 Jailed Cheats
      Modded/Hacked App: 가이더스 원 By izzle Inc.
      Bundle ID: com.izzle.go
      App Store Link: https://apps.apple.com/kr/app/%EA%B0%80%EC%9D%B4%EB%8D%94%EC%8A%A4-%EC%9B%90/id6752554540?uo=4

       

      📌 Mod Requirements

      - Non-Jailbroken/Jailed or Jailbroken iPhone or iPad.
      - Sideloadly or alternatives.
      - Computer running Windows/macOS/Linux with iTunes installed.

       

      🤩 Hack Features

      - Damage Multiplier
      - Defense Multiplier
      - Currency Multiplier
      - No ADS

       

      ⬇️ iOS Hack Download IPA Link


      Hidden Content

      Download via the iOSGods App







       

      📖 PC Installation Instructions

      STEP 1: Download the pre-hacked .IPA file from the link above to your computer. To download from the iOSGods App, see our iOSGods App IPA Download Tutorial which includes a video example.
      STEP 2: Download Sideloadly and install it on your Windows or Mac.
      STEP 3: Open Sideloadly on your computer, connect your iOS device, and wait until your device name appears in Sideloadly.
      STEP 4: Once your iDevice is recognized, drag the modded .IPA file you downloaded and drop it into the Sideloadly application.
      STEP 5: Enter your Apple Account email, then press “Start.” You’ll then be asked to enter your password. Go ahead and provide the required information.
      STEP 6: Wait for Sideloadly to finish sideloading/installing the hacked IPA. If there are issues during installation, please read the note below.
      STEP 7: Once the installation is complete and you see the app on your Home Screen, you will need to go to Settings -> General -> Profiles / VPN & Device Management. Once there, tap on the email you entered from step 6, and then tap on 'Trust [email protected]'.
      STEP 8: Now go to your Home Screen and open the newly installed app and everything should work fine. You may need to follow further per app instructions inside the hack's popup in-game.

      NOTE: iOS/iPadOS 16 and later, you must enable Developer Mode. For free Apple Developer accounts, you will need to repeat this process every 7 days. If you have any questions or problems, read our Sideloadly FAQ section of the topic and if you don't find a solution, please post your issue below and we'll do our best to help! If the hack does work for you, post your feedback below and help out other fellow members that are encountering issues.

       

      🙌 Credits

      - AlyssaX64

       

      📷 Cheat Video/Screenshots

      N/A
      • 10 replies
    • Raising a Female Warrior: Dual Idle KR / 여전사 키우기 : 듀얼 방치형 +5 Jailed Cheats
      Modded/Hacked App: 여전사 키우기 : 듀얼 방치형 By GT Games
      Bundle ID: com.gtgames.girlwarrior
      App Store Link: https://apps.apple.com/kr/app/%EC%97%AC%EC%A0%84%EC%82%AC-%ED%82%A4%EC%9A%B0%EA%B8%B0-%EB%93%80%EC%96%BC-%EB%B0%A9%EC%B9%98%ED%98%95/id6761979765?uo=4

       

      📌 Mod Requirements

      - Non-Jailbroken/Jailed or Jailbroken iPhone or iPad.
      - Sideloadly or alternatives.
      - Computer running Windows/macOS/Linux with iTunes installed.

       

      🤩 Hack Features

      - Damage Multiplier
      - Defense Multiplier
      - Currency Multiplier
      - Experience Multiplier
      - Attack Speed Multiplier

       

      ⬇️ iOS Hack Download IPA Link


      Hidden Content

      Download via the iOSGods App







       

      📖 PC Installation Instructions

      STEP 1: Download the pre-hacked .IPA file from the link above to your computer. To download from the iOSGods App, see our iOSGods App IPA Download Tutorial which includes a video example.
      STEP 2: Download Sideloadly and install it on your Windows or Mac.
      STEP 3: Open Sideloadly on your computer, connect your iOS device, and wait until your device name appears in Sideloadly.
      STEP 4: Once your iDevice is recognized, drag the modded .IPA file you downloaded and drop it into the Sideloadly application.
      STEP 5: Enter your Apple Account email, then press “Start.” You’ll then be asked to enter your password. Go ahead and provide the required information.
      STEP 6: Wait for Sideloadly to finish sideloading/installing the hacked IPA. If there are issues during installation, please read the note below.
      STEP 7: Once the installation is complete and you see the app on your Home Screen, you will need to go to Settings -> General -> Profiles / VPN & Device Management. Once there, tap on the email you entered from step 6, and then tap on 'Trust [email protected]'.
      STEP 8: Now go to your Home Screen and open the newly installed app and everything should work fine. You may need to follow further per app instructions inside the hack's popup in-game.

      NOTE: iOS/iPadOS 16 and later, you must enable Developer Mode. For free Apple Developer accounts, you will need to repeat this process every 7 days. If you have any questions or problems, read our Sideloadly FAQ section of the topic and if you don't find a solution, please post your issue below and we'll do our best to help! If the hack does work for you, post your feedback below and help out other fellow members that are encountering issues.

       

      🙌 Credits

      - AlyssaX64

       

      📷 Cheat Video/Screenshots

      N/A
      • 25 replies
    • (Raising a Hungry Dragon: Idle RPG) 배고파용 키우기 : 방치형 RPG +5 Jailed Cheats
      Modded/Hacked App: 배고파용 키우기 : 방치형 RPG By 3wave studio Co. Ltd.
      Bundle ID: com.threewavestudio.dragonidlerpg
      App Store Link: https://apps.apple.com/kr/app/%EB%B0%B0%EA%B3%A0%ED%8C%8C%EC%9A%A9-%ED%82%A4%EC%9A%B0%EA%B8%B0-%EB%B0%A9%EC%B9%98%ED%98%95-rpg/id6752611328?uo=4

       

      📌 Mod Requirements

      - Non-Jailbroken/Jailed or Jailbroken iPhone or iPad.
      - Sideloadly or alternatives.
      - Computer running Windows/macOS/Linux with iTunes installed.

       

      🤩 Hack Features

      - Damage Multiplier
      - Defense Multiplier
      - Drop/Reward/Loot Multiplier
      - Attack Speed Multiplier
      - No ADS

       

      ⬇️ iOS Hack Download IPA Link


      Hidden Content

      Download via the iOSGods App







       

      📖 PC Installation Instructions

      STEP 1: Download the pre-hacked .IPA file from the link above to your computer. To download from the iOSGods App, see our iOSGods App IPA Download Tutorial which includes a video example.
      STEP 2: Download Sideloadly and install it on your Windows or Mac.
      STEP 3: Open Sideloadly on your computer, connect your iOS device, and wait until your device name appears in Sideloadly.
      STEP 4: Once your iDevice is recognized, drag the modded .IPA file you downloaded and drop it into the Sideloadly application.
      STEP 5: Enter your Apple Account email, then press “Start.” You’ll then be asked to enter your password. Go ahead and provide the required information.
      STEP 6: Wait for Sideloadly to finish sideloading/installing the hacked IPA. If there are issues during installation, please read the note below.
      STEP 7: Once the installation is complete and you see the app on your Home Screen, you will need to go to Settings -> General -> Profiles / VPN & Device Management. Once there, tap on the email you entered from step 6, and then tap on 'Trust [email protected]'.
      STEP 8: Now go to your Home Screen and open the newly installed app and everything should work fine. You may need to follow further per app instructions inside the hack's popup in-game.

      NOTE: iOS/iPadOS 16 and later, you must enable Developer Mode. For free Apple Developer accounts, you will need to repeat this process every 7 days. If you have any questions or problems, read our Sideloadly FAQ section of the topic and if you don't find a solution, please post your issue below and we'll do our best to help! If the hack does work for you, post your feedback below and help out other fellow members that are encountering issues.

       

      🙌 Credits

      - AlyssaX64

       

      📷 Cheat Video/Screenshots

      N/A
      • 40 replies
×
  • Create New...

Important Information

We would like to place cookies on your device to help make this website better. The website cannot give you the best user experience without cookies. You can accept or decline our cookies. You may also adjust your cookie settings. Privacy Policy - Guidelines