Jump to content
  • Sky
  • Mint
  • Azure
  • Indigo
  • Blueberry
  • Blackcurrant
  • Watermelon
  • Strawberry
  • Pomegranate
  • Ruby Red
  • Orange
  • Banana
  • Apple
  • Emerald
  • Teal
  • Chocolate
  • Slate
  • Midnight
  • Maastricht
  • Charcoal
  • Matte Black

Rauhiq9a

Member
  • Content Count

    64
  • Joined

  • Last visited

Community Reputation

10 Beginner

About Rauhiq9a

  • Rank
    Member

Profile Information

  • iDevice
    iPhone 6s Plus
  • iOS Version
    12.4
  • Jailbroken
    Yes
  • Rooted
    No
  • Gender
    Male
  • Location
    Malaysia
  • Interests
    Learn to hack .. and making mod
  • Game Center
    Gm rauhiq

Recent Profile Visitors

216 profile views
  1. Merry Christmas to all iosgod community also to our awesome admin @DADi.
  2. _text:0000000100518C10 ; __text:00000001001F8D10↑p ... __text:0000000100518C10 STP X20, X19, [SP,#-0x20]! __text:0000000100518C14 STP X29, X30, [SP,#0x10] __text:0000000100518C18 ADD X29, SP, #0x10 __text:0000000100518C1C MOV X19, X3 __text:0000000100518C20 MOV X20, X2 __text:0000000100518C24 AND W8, W19, #7 __text:0000000100518C28 MOV W9, #1 __text:0000000100518C2C LSL W8, W9, W8 __text:0000000100518C30 MOV W9, #0x8E i got 2 match from my 1st watchpoint which is x3 = 0x0000000000002066 and x19 = 0x0000000000002066 @DADi @sweggyttes actually i just try n error with instruction since i'm a complete beginner in IDA and i only know how to locate the data stored but don't know how to mod them. And yup i found the data you suggest me to search for. if there any idea on how i can mod them i really appreciate it.. 🙏
  3. i tried to hack a game that only accept a data of (x8 + 6) otherwise game will crash . example: attack : 2000 x 8 = 16000 + 6= 16006 IDA address: 0x100518BF8 STR X19, [X20] so how can I edit that instruction to give an acceptable value such as 100100100 x 8= 800800800 + 6 = 800800806 *incase if needed* Offset: 1029ccbfc ASLR: 24b4000 HExdecimal of 800800806 = 2FBB4026 __text:0000000100518BF8 loc_100518BF8 ; CODE XREF: sub_100518A70+E4↑j __text:0000000100518BF8 ; sub_100518A70+154↑j ... __text:0000000100518BF8 STR X19, [X20] __text:0000000100518BFC LDP X29, X30, [SP,#0x30] __text:0000000100518C00 LDP X20, X19, [SP,#0x20] __text:0000000100518C04 LDP X22, X21, [SP,#0x10] __text:0000000100518C08 LDP X24, X23, [SP],#0x40 __text:0000000100518C0C RET __text:0000000100518C0C ; End of function sub_100518A70
  4. Where i can download ur template? edit: nvm found it already 😁 thank you
  5. hi.. i just fix my theos..now it works so what i did is reinstall theos using (setuptheos.sh setupAll) from this post then I had to manually install sdk that i prefer cuz that installer didn't install sdk when i use setupAll I also use this theos error guide from https://iphonedevwiki.net/index.php/Theos/Troubleshooting finally i can start making .deb hacks ... thank you @Crowned Arts @Ficgan and @ZoZo03XX
  6. I got bunch of fatal errors.. i think I'll continue this tmr cuz i got morning class .. thank you for your hard work to help me for today.. I'll msg you again tmr 👍🏻
  7. Choose a Template (required): 1 Project Name (required): bloodyharry Package Name [com.yourcompany.bloodyharry]: com.rauhiq9a.bloodyharry Author/Maintainer Name [System Administrator]: Rauhi9a [iOSGods Tweak Patcher v3.1] MobileSubstrate Bundle filter [com.apple.springboard]: com.FDGEntertainment.BloodyHarry [iOSGods Tweak Patcher v3.1] App Name: Bloody Harry Instantiating iOSGods Tweak Patcher v3.1 in bloodyharry/... Done. MUHD-IPHONE-BIN-APPLE:~ root# cd bloodyharry MUHD-IPHONE-BIN-APPLE:~/bloodyharry root# make package install > Making all for tweak bloodyharry… ==> Preprocessing Tweak.xm… ==> Preprocessing Tweak.xm… ==> Compiling Tweak.xm (arm64)… bash: line 1: 12763 Killed: 9 ( clang++ -x objective-c++ -c -I"/var/root/bloodyharry" -I/var/theos/include -I/var/theos/vendor/include -I/var/theos/include/_fallback -include /var/theos/Prefix.pch -MT /var/root/bloodyharry/.theos/obj/arm64/Tweak.xm.ea9c5ccc.o -MMD -MP -MF "/var/root/bloodyharry/.theos/obj/arm64/Tweak.xm.ea9c5ccc.Td" -fcolor-diagnostics -DTARGET_IPHONE=1 -Os -Wall -ggdb -Werror -isysroot "/var/theos/sdks/iPhoneOS11.2.sdk" -miphoneos-version-min=11.2 -fmodules -fcxx-modules -fmodule-name=bloodyharry -fbuild-session-file=/var/root/bloodyharry/.theos/build_session -fmodules-prune-after=345600 -fmodules-prune-interval=86400 -fmodules-validate-once-per-build-session -DTHEOS_INSTANCE_NAME="\"bloodyharry\"" -fmodules -fcxx-modules -fmodule-name=bloodyharry -fbuild-session-file=/var/root/bloodyharry/.theos/build_session -fmodules-prune-after=345600 -fmodules-prune-interval=86400 -fmodules-validate-once-per-build-session -arch arm64 /var/root/bloodyharry/.theos/obj/arm64/Tweak.xm.mm -o /var/root/bloodyharry/.theos/obj/arm64/Tweak.xm.ea9c5ccc.o ) make[3]: *** [/var/theos/makefiles/instance/rules.mk:268: /var/root/bloodyharry/.theos/obj/arm64/Tweak.xm.ea9c5ccc.o] Error 137 rm /var/root/bloodyharry/.theos/obj/arm64/Tweak.xm.mm make[2]: *** [/var/theos/makefiles/instance/library.mk:33: /var/root/bloodyharry/.theos/obj/arm64/bloodyharry.dylib] Error 2 make[2]: *** Waiting for unfinished jobs.... ==> Compiling Tweak.xm (armv7)… clang-5.0: error: invalid iOS deployment version '-miphoneos-version-min=11.2', iOS 10 is the maximum deployment target for 32-bit targets [-Winvalid-ios-deployment-target] make[3]: *** [/var/theos/makefiles/instance/rules.mk:268: /var/root/bloodyharry/.theos/obj/armv7/Tweak.xm.f2a76faa.o] Error 1 rm /var/root/bloodyharry/.theos/obj/armv7/Tweak.xm.mm make[2]: *** [/var/theos/makefiles/instance/library.mk:33: /var/root/bloodyharry/.theos/obj/armv7/bloodyharry.dylib] Error 2 make[1]: *** [/var/theos/makefiles/instance/library.mk:24: internal-library-all_] Error 2 make: *** [/var/theos/makefiles/master/rules.mk:111: bloodyharry.all.tweak.variables] Error 2
  8. hi, sorry for late reply.. it's 12.35 am here. yup i did try ios11.2 sdk manually since theosinstaller only support up to 10.3 only
  9. ya i did both manual and auto 1) theosinstaller 10.3 still get error when setup project and compile project then i managed to delete sdk and install patched sdk from git
  10. Sorry for late reply.. i fell sleep when i try to do as you say.. when i use patched sdk 10.3 from git , more fatal errors come up .. (couldn't load DARWIN) but i do have darwin installed in cydia i also has copy the binary from cydiasubstrate .. guess .. I'll need some time before i can use theos😩
  11. but from where i can get PrivateFrameworks 😅
  12. yup i got this error when creating new project for now i only get this errors looks like it fail to link on both arm7 and arm 64 ==> Linking bundle bloodyharry (armv7)… ld: framework not found Preferences clang-5.0: error: linker command failed with exit code 1 (use -v to see invocati on) make[4]: *** [/var/theos/makefiles/instance/bundle.mk:37: /var/root/bloodyharry/ .theos/obj/armv7/bloodyharry.bundle/bloodyharry] Error 1 ==> Linking bundle bloodyharry (arm64)… ld: framework not found Preferences clang-5.0: error: linker command failed with exit code 1 (use -v to see invocati on)
  13. idk if this normal or not cuz i didn't edit .xm yet i got this after i enter mpi for the 2nd time MUHD-IPHONE-BIN-APPLE:~/bloodyharry root# make package install > Making all for tweak bloodyharry… ==> Preprocessing Tweak.xm… ==> Compiling Tweak.xm (arm64)… ==> Linking tweak bloodyharry (arm64)… ==> Generating debug symbols for bloodyharry… ==> Stripping bloodyharry (arm64)… rm /var/root/bloodyharry/.theos/obj/arm64/Tweak.xm.mm ==> Merging tweak bloodyharry… ==> Signing bloodyharry… > Making all in bloodyharrySettings… > Making all for bundle bloodyharry… ==> Copying resource directories into the bundle wrapper… ==> Compiling bloodyharry.mm (arm64)… ==> Compiling bloodyharry.mm (armv7)… ==> Linking bundle bloodyharry (arm64)… ld: framework not found Preferences clang-5.0: error: linker command failed with exit code 1 (use -v to see invocation) make[4]: *** [/var/theos/makefiles/instance/bundle.mk:37: /var/root/bloodyharry/.theos/obj/arm64/bloodyharry.bundle/bloodyharry] Error 1 make[3]: *** [/var/theos/makefiles/instance/bundle.mk:37: /var/root/bloodyharry/.theos/obj/arm64/bloodyharry.bundle/bloodyharry] Error 2 make[3]: *** Waiting for unfinished jobs.... ==> Linking bundle bloodyharry (armv7)… ld: framework not found Preferences clang-5.0: error: linker command failed with exit code 1 (use -v to see invocation) make[4]: *** [/var/theos/makefiles/instance/bundle.mk:37: /var/root/bloodyharry/.theos/obj/armv7/bloodyharry.bundle/bloodyharry] Error 1 make[3]: *** [/var/theos/makefiles/instance/bundle.mk:37: /var/root/bloodyharry/.theos/obj/armv7/bloodyharry.bundle/bloodyharry] Error 2 make[2]: *** [/var/theos/makefiles/instance/bundle.mk:26: internal-bundle-all_] Error 2 make[1]: *** [/var/theos/makefiles/master/rules.mk:111: bloodyharry.all.bundle.variables] Error 2 make: *** [/var/theos/makefiles/master/aggregate.mk:12: internal-all] Error 2
  14. i remove arm64e from the list and it almost success i will delete theos. reinstall sdk10.3 and remove arm64e then i will update the result this is the result Choose a Template (required): 1 Project Name (required): bloodyharry Package Name [com.yourcompany.bloodyharry]: com.rauhiq9a.bloodyharry Author/Maintainer Name [System Administrator]: Rauhiq9a [iOSGods Tweak Patcher v3.1] MobileSubstrate Bundle filter [com.apple.springboar d]: com.FDGEntertainment.BloodyHarry [iOSGods Tweak Patcher v3.1] App Name: Bloody Harry Instantiating iOSGods Tweak Patcher v3.1 in bloodyharry/... Done. MUHD-IPHONE-BIN-APPLE:~ root# cd bloodyharry MUHD-IPHONE-BIN-APPLE:~/bloodyharry root# make package install > Making all for tweak bloodyharry… ==> Preprocessing Tweak.xm… ==> Preprocessing Tweak.xm… ==> Compiling Tweak.xm (arm64)… ==> Compiling Tweak.xm (armv7)… ==> Linking tweak bloodyharry (arm64)… ==> Generating debug symbols for bloodyharry… ==> Stripping bloodyharry (arm64)… rm /var/root/bloodyharry/.theos/obj/arm64/Tweak.xm.mm ==> Linking tweak bloodyharry (armv7)… ==> Generating debug symbols for bloodyharry… ==> Stripping bloodyharry (armv7)… rm /var/root/bloodyharry/.theos/obj/armv7/Tweak.xm.mm ==> Merging tweak bloodyharry… ==> Signing bloodyharry… > Making all in bloodyharrySettings… > Making all for bundle bloodyharry… ==> Copying resource directories into the bundle wrapper… ==> Compiling bloodyharry.mm (armv7)… ==> Compiling bloodyharry.mm (arm64)… ==> Linking bundle bloodyharry (armv7)… ld: framework not found Preferences clang-5.0: error: linker command failed with exit code 1 (use -v to see invocati on) make[4]: *** [/var/theos/makefiles/instance/bundle.mk:37: /var/root/bloodyharry/ .theos/obj/armv7/bloodyharry.bundle/bloodyharry] Error 1 ==> Linking bundle bloodyharry (arm64)… ld: framework not found Preferences clang-5.0: error: linker command failed with exit code 1 (use -v to see invocati on) make[4]: *** [/var/theos/makefiles/instance/bundle.mk:37: /var/root/bloodyharry/ .theos/obj/arm64/bloodyharry.bundle/bloodyharry] Error 1 make[3]: *** [/var/theos/makefiles/instance/bundle.mk:37: /var/root/bloodyharry/ .theos/obj/armv7/bloodyharry.bundle/bloodyharry] Error 2 make[3]: *** Waiting for unfinished jobs.... make[3]: *** [/var/theos/makefiles/instance/bundle.mk:37: /var/root/bloodyharry/ .theos/obj/arm64/bloodyharry.bundle/bloodyharry] Error 2 make[2]: *** [/var/theos/makefiles/instance/bundle.mk:26: internal-bundle-all_] Error 2 make[1]: *** [/var/theos/makefiles/master/rules.mk:111: bloodyharry.all.bundle.v ariables] Error 2 make: *** [/var/theos/makefiles/master/aggregate.mk:12: internal-all] Error 2
  • Recently Browsing   0 members

    No registered users viewing this page.


    • Administrator |
    • Special Rank |
    • ViP Plus |
    • ViP Jailed |
    • ViP |
    • Cheater  |
    • Modder  |
    • Novice Cheater |
    • Rookie Modder |
    • Contributor |
    • Senior Member |
    • Member |
×
×
  • Create New...

Important Information

We have placed cookies on your device to help make this website better. You can adjust your cookie settings, otherwise we'll assume you're okay to continue. Privacy Policy - Guidelines